R4_Caseid_pub,R4_C_Rtype,R4_C_Resptype,R4_c_IntAge_Pub,R4_ORGSAMPINFO_SEX,R4_ORGSAMPINFO_BSTATUS,R4_a_strata,R4_a_psu_pub,R4_WTR4_BEN,R4_B1,R4_B3,R4_B23_2,R4_B23_3,R4_b24_i,R4_B25_A,R4_B25_B,R4_B25_C,R4_B25_D,R4_B25_F,R4_B25_G,R4_B25_H,R4_B25_I,R4_B25_J,R4_B25_L,R4_B25_M,R4_B25_N,R4_B25_O,R4_B25_P,R4_B25_Q,R4_B26,R4_B28,R4_B28A,R4_B29_A,R4_B29_B,R4_B29_C,R4_B29_D,R4_B29_E,R4_B29_F,R4_B29_G,R4_B29_H,R4_B29_1A,R4_B29_7_A,R4_B29_7_B,R4_B29_7_C,R4_B29_7_D,R4_B29_7_E,R4_B29_7_F,R4_B29_7_G,R4_B29_7_H,R4_B29_7_I,R4_B29_7_J,R4_B29_7_K,R4_B30,R4_B30_B,R4_B37,R4_B37A,R4_B38,R4_B39,R4_B40,R4_B41,R4_B42,R4_B43,R4_B44,R4_B45,R4_B46,R4_B47_A,R4_B47_B,R4_B47_C,R4_B47_D,R4_C_MAINCONCOLDIAGGRP_I_PUB,R4_c_adultchild_onset_i,R4_C_WrkdWhenLim,R4_C_EvrWorked,R4_C5A_1,R4_C7_1,R4_C10_1,R4_C18_1,R4_C20A_1,R4_C20B_1,R4_C20C_1,R4_C20D_1,R4_C20H_1,R4_C22,R4_C27,R4_C39_A,R4_C39_B,R4_C39_C,R4_C39_D,R4_C39_E,R4_C39_F,R4_C39_G,R4_C39_H,R4_C39_I,R4_C39_J,R4_C39_K,R4_C39_L,R4_C39A2,R4_C39B_A,R4_C39B_B,R4_C39B_C,R4_C39B_D,R4_C39B_E,R4_C39B_F,R4_C39b_g,R4_C39_1,R4_C39_3_A,R4_C39_3_B,R4_C39_3_C,R4_C39_3_D,R4_C39_3_E,R4_C39_3_F,R4_C39_3_G,R4_C39_3_H,R4_C39_4,R4_C39_4A,R4_C39_5,R4_C39_6,R4_C_MainCurJobSOC_PUB,R4_C_MainCurJobNAICS_PUB,R4_C_TotCurMnthPay_i_PUB,R4_C_MnthsMainCurJob_PUB,R4_C_MainCurJobRepSSA_PUB,R4_C_TotCurWkHrs_i_PUB,R4_C_TotCurHrMnth_i_PUB,R4_D1,R4_d6yr_m_PUB,R4_D8yr_m_PUB,R4_D15_m_PUB,R4_D16_m_PUB,R4_D17_m_PUB,R4_D18_m_PUB,R4_D25A,R4_D25_A,R4_D25_B,R4_D25_C,R4_D25_D,R4_D25_E,R4_D25_F,R4_D25_g,R4_D25_1,R4_D26_A,R4_D26_B,R4_D26_C,R4_D26_D,R4_D26_E,R4_D26_F,R4_D26_G,R4_D26_H,R4_D26_i,R4_D26_j,R4_D27,R4_D28,R4_D29,R4_D30,R4_C_MainJob2009SOC_PUB,R4_C_MainJob2009NAICS_PUB,R4_C_MainJobMnthPay2009_PUB,R4_C_MnthsMain2009Job,R4_C_TOT2009PAY_PUB,R4_C_TotHrs2009_PUB,R4_C_UsWkHr2009_PUB,R4_E3,R4_E5,R4_E7,R4_E9,R4_E12,R4_E15,R4_E16,R4_E17,R4_E19,R4_E20_A,R4_E20_B,R4_E20_C,R4_E20_D,R4_E20E_1,R4_E20_E,R4_E21,R4_E22,R4_E26,R4_E27_1,R4_E27_2,R4_E27_3,R4_E27_4,R4_E27_5,R4_E28_1,R4_E28_2,R4_E28_3,R4_E28_4,R4_E28_5,R4_E28_6,R4_E28_7,R4_E28_8,R4_E28_9,R4_E28_10,R4_E34,R4_E35,R4_C_AwareTTW,R4_F31_1,R4_F31_2,R4_F31_3,R4_F31_5,R4_F31_6,R4_F31_7,R4_F31_8,R4_F31_14,R4_F31_15,R4_F31_16,R4_F32,R4_F33_A,R4_F33_B,R4_F33_C,R4_F33_D,R4_F33_E,R4_F33_F,R4_G1,R4_G10,R4_G15,R4_G19,R4_G23,R4_G26,R4_G29,R4_G53_1,R4_G53_2,R4_G53_3,R4_G53_4,R4_G53_5,R4_G53_6,R4_G53_7,R4_G53_8,R4_G53_9,R4_G54,R4_G57,R4_G58,R4_G59,R4_G60,R4_G61_1,R4_G61_2,R4_G61_3,R4_G61_4,R4_G61_5,R4_G61_6,R4_G61_7,R4_C_EvrUseSVR,R4_C_EvrUseWel,R4_C_EvrUseSMenH,R4_C_EvrUseOStat,R4_C_EvrUsePriv,R4_C_EvrUseOth,R4_C_EvrUseSchool,R4_C_EvrUseUnemply,R4_C_EvrUseClinic,R4_C_EvrUseRehab,R4_C_EvrUseOthMed,R4_C_EmpProvUnkwn,R4_C_MedProvUnkwn,R4_C_EvrUsedServ,R4_C_EvrUseEmploy,R4_C_NUMPROV2009_pub,R4_C_NUMPROVEVUSED_pub,R4_C_UseSVR2009,R4_C_UseWEL2009,R4_C_UseSMenH2009,R4_C_UseOthSt2009,R4_C_UsePriv2009,R4_C_UseOthNonSt2009,R4_C_UseSchool2009,R4_C_UseUnemp2009,R4_C_UseClinic2009,R4_C_UseRehab2009,R4_C_UseOthMed2009,R4_C_EmpUnkwn2009,R4_C_MedUnkwn2009,R4_C_ServUse2009,R4_C_PhyTH2009,R4_C_OccTher2009,R4_C_SpchTher2009,R4_C_MedProc2009,R4_C_Equip2009,R4_C_Coun2009,R4_C_GrpTh2009,R4_C_WrkAs2009,R4_C_FindJob2009,R4_C_JobTrn2009,R4_C_JobMod2009,R4_C_JobCch2009,R4_C_OtherServ2009,R4_C_PROVTYPE2009_01_1,R4_C_PROVTYPE2009_03_1,R4_C_PROVTYPE2009_04_1,R4_C_PROVTYPE2009_05_1,R4_C_PROVTYPE2009_07_1,R4_C_PROVTYPE2009_10_1,R4_C_PROVTYPE2009_10_2,R4_C_PROVTYPE2009_10_3,R4_C_PROVTYPE2009_11_1,R4_C_PROVTYPE2009_12_1,R4_C_PHYTH2009_01_1,R4_C_OCCTH2009_01_1,R4_C_SPCHTH2009_01_1,R4_C_MED2009_01_1,R4_C_EQUIP2009_01_1,R4_C_COUN2009_01_1,R4_C_GRPTH2009_01_1,R4_C_WRKAS2009_01_1,R4_C_FNDJOB2009_01_1,R4_C_JOBTRN2009_01_1,R4_C_JOBMD2009_01_1,R4_C_JOBCCH2009_01_1,R4_C_OTHR2009_01_1,R4_C_PHYTH2009_03_1,R4_C_OCCTH2009_03_1,R4_C_SPCHTH2009_03_1,R4_C_MED2009_03_1,R4_C_EQUIP2009_03_1,R4_C_COUN2009_03_1,R4_C_GRPTH2009_03_1,R4_C_WRKAS2009_03_1,R4_C_FNDJOB2009_03_1,R4_C_JOBTRN2009_03_1,R4_C_JOBMD2009_03_1,R4_C_JOBCCH2009_03_1,R4_C_OTHR2009_03_1,R4_C_PHYTH2009_04_1,R4_C_OCCTH2009_04_1,R4_C_SPCHTH2009_04_1,R4_C_MED2009_04_1,R4_C_EQUIP2009_04_1,R4_C_COUN2009_04_1,R4_C_GRPTH2009_04_1,R4_C_WRKAS2009_04_1,R4_C_FNDJOB2009_04_1,R4_C_JOBTRN2009_04_1,R4_C_JOBMD2009_04_1,R4_C_JOBCCH2009_04_1,R4_C_OTHR2009_04_1,R4_C_PHYTH2009_05_1,R4_C_OCCTH2009_05_1,R4_C_SPCHTH2009_05_1,R4_C_MED2009_05_1,R4_C_EQUIP2009_05_1,R4_C_COUN2009_05_1,R4_C_GRPTH2009_05_1,R4_C_WRKAS2009_05_1,R4_C_FNDJOB2009_05_1,R4_C_JOBTRN2009_05_1,R4_C_JOBMD2009_05_1,R4_C_JOBCCH2009_05_1,R4_C_OTHR2009_05_1,R4_C_PHYTH2009_07_1,R4_C_OCCTH2009_07_1,R4_C_SPCHTH2009_07_1,R4_C_MED2009_07_1,R4_C_EQUIP2009_07_1,R4_C_COUN2009_07_1,R4_C_GRPTH2009_07_1,R4_C_WRKAS2009_07_1,R4_C_FNDJOB2009_07_1,R4_C_JOBTRN2009_07_1,R4_C_JOBMD2009_07_1,R4_C_JOBCCH2009_07_1,R4_C_OTHR2009_07_1,R4_C_PHYTH2009_10_1,R4_C_OCCTH2009_10_1,R4_C_SPCHTH2009_10_1,R4_C_MED2009_10_1,R4_C_EQUIP2009_10_1,R4_C_COUN2009_10_1,R4_C_GRPTH2009_10_1,R4_C_WRKAS2009_10_1,R4_C_FNDJOB2009_10_1,R4_C_JOBTRN2009_10_1,R4_C_JOBMD2009_10_1,R4_C_JOBCCH2009_10_1,R4_C_OTHR2009_10_1,R4_C_PHYTH2009_10_2,R4_C_OCCTH2009_10_2,R4_C_SPCHTH2009_10_2,R4_C_MED2009_10_2,R4_C_EQUIP2009_10_2,R4_C_COUN2009_10_2,R4_C_GRPTH2009_10_2,R4_C_WRKAS2009_10_2,R4_C_FNDJOB2009_10_2,R4_C_JOBTRN2009_10_2,R4_C_JOBMD2009_10_2,R4_C_JOBCCH2009_10_2,R4_C_OTHR2009_10_2,R4_C_PHYTH2009_10_3,R4_C_OCCTH2009_10_3,R4_C_SPCHTH2009_10_3,R4_C_MED2009_10_3,R4_C_EQUIP2009_10_3,R4_C_COUN2009_10_3,R4_C_GRPTH2009_10_3,R4_C_WRKAS2009_10_3,R4_C_FNDJOB2009_10_3,R4_C_JOBTRN2009_10_3,R4_C_JOBMD2009_10_3,R4_C_JOBCCH2009_10_3,R4_C_OTHR2009_10_3,R4_C_PHYTH2009_11_1,R4_C_OCCTH2009_11_1,R4_C_SPCHTH2009_11_1,R4_C_MED2009_11_1,R4_C_EQUIP2009_11_1,R4_C_COUN2009_11_1,R4_C_GRPTH2009_11_1,R4_C_WRKAS2009_11_1,R4_C_FNDJOB2009_11_1,R4_C_JOBTRN2009_11_1,R4_C_JOBMD2009_11_1,R4_C_JOBCCH2009_11_1,R4_C_OTHR2009_11_1,R4_C_PHYTH2009_12_1,R4_C_OCCTH2009_12_1,R4_C_SPCHTH2009_12_1,R4_C_MED2009_12_1,R4_C_EQUIP2009_12_1,R4_C_COUN2009_12_1,R4_C_GRPTH2009_12_1,R4_C_WRKAS2009_12_1,R4_C_FNDJOB2009_12_1,R4_C_JOBTRN2009_12_1,R4_C_JOBMD2009_12_1,R4_C_JOBCCH2009_12_1,R4_C_OTHR2009_12_1,R4_C_NUMPROVCONT_01_1,R4_C_PROVUSE2009_01_1,R4_C_DURPROVVISIT_01_1,R4_C_NUMPROVCONT_03_1,R4_C_PROVUSE2009_03_1,R4_C_DURPROVVISIT_03_1,R4_C_NUMPROVCONT_04_1,R4_C_PROVUSE2009_04_1,R4_C_DURPROVVISIT_04_1,R4_C_NUMPROVCONT_05_1,R4_C_PROVUSE2009_05_1,R4_C_DURPROVVISIT_05_1,R4_C_NUMPROVCONT_07_1,R4_C_PROVUSE2009_07_1,R4_C_DURPROVVISIT_07_1,R4_C_NUMPROVCONT_10_1,R4_C_PROVUSE2009_10_1,R4_C_DURPROVVISIT_10_1,R4_C_NUMPROVCONT_10_2,R4_C_PROVUSE2009_10_2,R4_C_DURPROVVISIT_10_2,R4_C_NUMPROVCONT_10_3,R4_C_PROVUSE2009_10_3,R4_C_DURPROVVISIT_10_3,R4_C_NUMPROVCONT_11_1,R4_C_PROVUSE2009_11_1,R4_C_DURPROVVISIT_11_1,R4_C_NUMPROVCONT_12_1,R4_C_PROVUSE2009_12_1,R4_C_DURPROVVISIT_12_1,R4_I1_I,R4_I2,R4_I3,R4_I4,R4_I5,R4_I6,R4_I7,R4_I8,R4_I9_I,R4_I10,R4_I11,R4_I12,R4_I17a_I,R4_I17b_I,R4_I18_I,R4_I19_I,R4_I21_I,R4_I22_I,R4_I23_I,R4_I25_I,R4_I26_I,R4_I29_I,R4_I30_I,R4_I31_I,R4_I32_1,R4_I32_2,R4_I33_I,R4_I34_I,R4_I35_I,R4_I36_I,R4_I37_I,R4_I38_I,R4_I39_I,R4_I40_I,R4_I41_I,R4_I42_I,R4_I43_I,R4_I44_I,R4_I45_i,R4_i46_i,R4_I47_i,R4_i48_i,R4_I49_i,R4_i50_i,R4_I51_i,R4_i52_i,R4_I53_i,R4_i54_i,R4_I55_i,R4_i56_i,R4_I57_i,R4_i58_i,R4_I59_I,R4_I60_I,R4_I61_I,R4_C_EquipFuncLim_I,R4_C_PCS8TOT_I,R4_C_MCS8TOT_I,R4_CageScore_indicator_i,R4_J8,R4_J10,R4_J11_1,R4_J11_2,R4_J11_7,R4_J11_8,R4_J11_9,R4_J11_10_PUB,R4_C_CurMedicare,R4_C_CurMedicaid,R4_C_CurMilInsur,R4_C_CurPrivEmp,R4_C_CurPrivSp,R4_C_CurPrivSelf,R4_C_CurOtherInsur,R4_C_CurNoInsur,R4_IncSource1_PUB,R4_IncSource2_PUB,R4_IncSource3_PUB,R4_IncSource4_PUB,R4_IncSource5_PUB,R4_IncSource6_PUB,R4_IncSource7_PUB,R4_C_LSTMNTHPAY_PUB,R4_C_TotGovCashBen_PUB,R4_C_TotNonCashBen_PUB,R4_L3_i_PUB,R4_L4_PUB,R4_L5_PUB,R4_L8_I_PUB,R4_L11_I_PUB,R4_L12_PUB,R4_L15,R4_L24_PUB,R4_c_cohab_i,R4_C_race_I_PUB,R4_c_bmi_cat_i,R4_C_HHSize_PUB,R4_C_NumChildHH_PUB,R4_C_NumOwnChildHH_PUB,R4_C_NumNonOwnChildHH_PUB,R4_C_NumOwnChildOHH_PUB,R4_C_NumOwnChild_PUB,R4_C_NumAdultHH_PUB,R4_C_FEDPOVERTYLEVEL_CAT1,R4_C_HHINC2009_PUB,R4_N_SSILASTMNTH_PUB,R4_N_SSDILASTMNTH_PUB,R4_N_DEPENLASTMNTH_PUB,R4_N_TotSSbenLastMnth_PUB,R4_N_BenAbsofEarn_atInt_PUB,R4_N_MCARE_ATINT,R4_N_MthsEarlEnt_PUB,R4_N_MthsRecEnt_PUB,R4_N_SSDI_atInt_PUB,R4_N_SSI_atInt_PUB,R4_N_TotSSbeN_atInt_PUB,R4_N_BENSTATATINT2,R4_N_SSDINOMCR_ATINT,R4_N_PIAatInt_PUB
70004109,1,1,4,1,2,3000,85124294,16529.473554,1,0,1,,0,1,0,0,0,0,0,1,0,0,0,1,0,0,0,0,0,0,,,,,,,,,,,,,,,,,,,,,,0,0,1,1,0,,,,,,,,,3,,3,,0,2,1,1,,,,,,,,,,,,,,,,,,,,,,,,,,,,,,,,,,,,,,,,,,,,,,,,,,,,,,,,,,,,,,,,,,,,,,,,,,,,,,,,,,,,,,,,,,,,,,0,,0,0,0,,0,,0,0,0,0,,,,,,,,,,,,,,,,,,,0,,,,,,,,,,,,,,,,,,0,0,0,0,0,,,,,,,,,,,,,,0,,0,,,,,,,,0,0,0,0,0,0,0,0,0,0,0,0,0,0,0,0,0,0,0,0,0,0,0,0,0,0,0,0,0,0,0,,,,,,,,,,,,,,,,,,,,,,,,,,,,,,,,,,,,,,,,,,,,,,,,,,,,,,,,,,,,,,,,,,,,,,,,,,,,,,,,,,,,,,,,,,,,,,,,,,,,,,,,,,,,,,,,,,,,,,,,,,,,,,,,,,,,,,,,,,,,,,,,,,,,,,,,,,,,,,,,,,,,,,,,,,,,,,,,,,,,,,,,5,4,5,3,4,5,4,3,5,1,0,0,0,,1,0,0,,,0,,1,0,0,,,0,,0,,0,,1,1,1,1,1,1,0,,0,,0,,0,,1,0,0,,0,,1,1,0,0,30.03,31.51,0,,0,,,,,,,1,0,0,0,0,0,0,0,0,0,0,0,0,0,1,0,1330,0,1,D,1,2,6,1,,4,0,5,4,1,0,0,0,0,0,1,3,D,0,1300,0,1300,1300,1,84,84,1300,0,1300,2,0,1300
70005058,1,1,2,1,2,2000,85098106,5072.1690826,1,0,3,0,1,,,,,,,,,,,,,,,,,,,,,,,,,,,,,,,,,,,,,,,0,,0,1,0,,,,,,,,,2,1,2,2,0,2,1,1,1,0,1,2,0,0,0,0,0,0,0,3,4,1,4,4,2,3,2,2,3,3,2,0,,,,,,,,0,0,0,0,1,0,0,0,0,0,,0,,1,99,4,6,1,30,131,,,,,,,,,,,,,,,,,,,,,,,,,,,,,,,,,,,,,,,,,,,1,1,0,0,0,,0,,0,0,0,0,,,,,,,,,,,,,,,,,,,0,,,,,,,,,,,,,,,,,,0,0,0,0,0,,,,,,,,,,,,,,0,,0,,,,,,,,0,0,0,0,0,0,0,0,0,0,0,0,0,0,0,0,0,0,0,0,0,0,0,0,0,0,0,0,0,0,0,,,,,,,,,,,,,,,,,,,,,,,,,,,,,,,,,,,,,,,,,,,,,,,,,,,,,,,,,,,,,,,,,,,,,,,,,,,,,,,,,,,,,,,,,,,,,,,,,,,,,,,,,,,,,,,,,,,,,,,,,,,,,,,,,,,,,,,,,,,,,,,,,,,,,,,,,,,,,,,,,,,,,,,,,,,,,,,,,,,,,,,,3,1,1,3,2,1,1,1,3,1,0,0,0,,0,,0,,,0,,0,,,,,0,,0,,0,,0,,0,,0,,0,,0,,0,,0,,0,,0,,0,,0,0,0,0,50.94,57.57,0,,1,1,2,0,0,0,0,1,1,0,0,0,0,0,0,0,0,0,0,0,0,1,3,770,0,2,3,1,2,2,1,,,1,5,4,3,0,0,0,0,0,2,1,1,0,800,0,800,800,1,48,48,750,0,800,2,0,800
70000612,1,1,3,0,2,3000,85067389,4182.6625475,1,1,2,1,0,1,0,0,0,1,0,0,0,1,0,0,0,0,0,0,0,0,,,,,,,,,,,,,,,,,,,,,,0,1,0,0,0,,,,,,,,,4,,3,,0,2,1,1,,,,,,,,,,,,,,,,,,,,,,,,,,,,,,,,,,,,,,,,,,,,,,,,,,,,,,,,,,,,,,,,,,,,,,,,,,,,,,,,,,,,,,,,,,,,,,1,1,1,0,1,0,1,0,0,0,1,,3,,,,,,,,,,,,,,,,0,0,1,,,,,,,,,,,,,,,,,,0,0,0,0,1,0,,,,,,,,,,,,,0,,0,,,,,,,,0,0,0,0,0,0,1,0,0,0,0,0,0,0,0,0,0,0,0,0,0,0,0,0,0,0,0,0,0,0,0,,,,,,,,,,,,,,,,,,,,,,,,,,,,,,,,,,,,,,,,,,,,,,,,,,,,,,,,,,,,,,,,,,,,,,,,,,,,,,,,,,,,,,,,,,,,,,,,,,,,,,,,,,,,,,,,,,,,,,,,,,,,,,,,,,,,,,,,,,,,,,,,,,,,,,,,,,,,,,,,,,,,,,,,,,,,,,,,,,,,,,,,4,3,4,4,4,3,3,2,2,1,1,1,1,0,,,0,,,0,,1,0,1,1,2,1,1,0,,0,,0,,1,1,1,1,0,,1,0,0,,0,,0,,0,,0,,1,1,0,1,31.81,42.74,0,,1,0,2,7,0,0,0,1,0,0,1,0,0,0,0,0,0,0,1,0,0,1,0,1600,0,2,4,2,2,2,1,,,0,5,3,2,0,0,0,0,0,2,4,3,0,1300,0,1500,1500,1,78,72,1300,0,1500,2,0,1400
70002542,2,3,1,1,1,3000,85110430,1355.7215553,1,1,1,,0,1,1,1,0,0,0,1,0,0,0,1,0,0,0,0,0,0,,,,,,,,,,,,,,,,,,,,,,0,0,0,1,0,,,,,,,,,4,,3,,1,1,0,0,,,,,,,,,,,,,,,,,,,,,,,,,,,,,,,,,,,,,,,,,,,,,,,,,,,,,,,,,,,,,,,,,,,,,,,,,,,,,,,,,,,,,,,,,0,0,0,0,0,,,,0,0,,1,0,1,0,D,1,,,,,,,,,,,,,,,,,,,D,,,,,,,,,,,,,,,,,,0,0,0,1,0,,,0,0,3,0,0,0,0,0,0,0,,1,1,0,,,,,,,,0,0,1,0,0,0,0,0,0,0,0,0,0,1,0,1,1,0,0,1,0,0,0,0,0,0,0,0,0,0,1,,,,1,,1,1,,,,,,,,3,,,,,,,,,,,,,,,,,,,,,,0,0,0,1,0,1,1,0,0,0,0,0,0,,,,,,,,,,,,,,,,,,,,,,,,,,,,,,,,,,,,,,,,,,,,,,,,,,,,,,,,,,,,,,,,,,,,,,,,,,,,,,,,,,,,,,,,,,,,,,,,,,,,,,,,,,,,24,2,1,,,,,,,,,,,,,,,,,,,,,,,,,5,1,2,3,5,5,5,4,4,0,1,1,0,,0,,0,,,0,,0,,,,,0,,0,,0,,0,,1,1,0,,0,,1,1,1,0,1,0,1,1,1,1,0,,1,1,1,0,50.98,10.21,1,,1,1,0,0,8,0,0,0,1,0,0,1,0,0,0,0,0,0,0,0,0,1,0,640,0,1,1,1,2,2,1,,,0,5,4,3,1,0,1,0,0,2,7,5,600,0,0,600,600,0,54,54,0,650,600,1,0,0
70005196,1,1,2,0,1,1000,85130116,2200.5187077,1,1,5,0,0,1,0,0,1,0,0,0,0,0,0,0,0,0,0,0,0,0,,,,,,,,,,,,,,,,,,,,,,0,0,0,1,0,,,,,,,,,4,,R,,1,1,0,0,,,,,,,,,,,,,,,,,,,,,,,,,,,,,,,,,,,,,,,,,,,,,,,,,,,,,,,,,,,,,,,,,,,,,,,,,,,,,,,,,,,,,,,,,0,0,0,0,,,,,0,0,,0,,0,0,0,0,,,,,,,,,,,,,,,,,,,0,,,,,,,,,,,,,,,,,,0,0,0,0,1,0,,,,,,,,,,,,,0,,1,1,0,0,0,0,0,0,0,0,0,0,0,0,1,0,0,0,0,0,0,0,0,0,0,0,0,0,0,0,0,0,0,0,0,0,0,0,0,,,,,,,,,,,,,,,,,,,,,,,,,,,,,,,,,,,,,,,,,,,,,,,,,,,,,,,,,,,,,,,,,,,,,,,,,,,,,,,,,,,,,,,,,,,,,,,,,,,,,,,,,,,,,,,,,,,,,,,,,,,,,,,,,,,,,,,,,,,,,,,,,,,,,,,,,,,,,,,,,,,,,,,,,,,,,,,,,,,,,,,,4,3,4,5,3,3,2,1,3,0,0,0,0,,0,,0,,,0,,0,,,,,1,1,0,,0,,0,,0,,1,1,0,,0,,0,,0,,0,,0,,0,,1,0,0,0,27.74,53.72,0,,1,1,0,0,0,0,0,0,1,0,0,0,0,0,0,0,0,0,0,1,0,1,0,660,230,1,R,1,1,2,1,,,1,5,2,6,1,1,0,0,3,2,1,2,700,0,0,700,800,0,204,204,150,650,800,1,0,1100
70003431,1,1,2,0,2,3000,85066372,2216.0241314,1,1,1,,0,1,0,0,0,0,0,0,0,0,0,0,0,0,0,0,0,0,,,,,,,,,,,,,,,,,,,,,,0,0,0,0,0,,,,,,,,,3,,3,,0,2,0,1,,,,,,,,,,,,,,,,,,,,,,,,,,,,,,,,,,,,,,,,,,,,,,,,,,,,,,,,,,,,,,,,,,,,,,,,,,,,,,,,,,,,,,,,,,,,,,0,,0,0,0,,0,,0,0,0,0,,,,,,,,,,,,,,,,,,,0,,,,,,,,,,,,,,,,,,0,0,0,0,0,,,,,,,,,,,,,,0,,0,,,,,,,,0,0,0,0,0,0,0,0,0,0,0,0,0,0,0,0,0,0,0,0,0,0,0,0,0,0,0,0,0,0,0,,,,,,,,,,,,,,,,,,,,,,,,,,,,,,,,,,,,,,,,,,,,,,,,,,,,,,,,,,,,,,,,,,,,,,,,,,,,,,,,,,,,,,,,,,,,,,,,,,,,,,,,,,,,,,,,,,,,,,,,,,,,,,,,,,,,,,,,,,,,,,,,,,,,,,,,,,,,,,,,,,,,,,,,,,,,,,,,,,,,,,,,3,5,5,3,4,3,1,2,3,1,0,1,1,0,,,0,,,0,,1,0,1,1,2,1,0,1,0,0,,0,,1,1,1,0,0,,0,,0,,0,,0,,0,,0,,0,0,0,1,23.23,58.28,0,,1,0,0,0,0,0,10,1,0,0,0,0,0,0,0,0,0,0,1,0,0,1,0,760,0,1,D,2,2,2,1,,D,0,5,2,4,0,0,0,0,0,2,2,D,0,800,0,800,800,1,174,138,750,0,800,2,0,800
70002769,1,2,2,0,1,3000,85110424,1751.6535047,1,1,3,0,0,1,0,0,0,0,0,0,0,0,0,0,0,0,0,0,0,0,,,,,,,,,,,,,,,,,,,,,,0,0,0,0,1,3,2,0,,,,,,4,,4,,0,2,1,1,,,,,,,,,,,,,,,,,,,,,,,,,,,,,,,,,,,,,,,,,,,,,,,,,,,,,,,,,,,,,,,,,,,,,,,,,,,,,,,,,,,,,,,,,0,0,0,0,,,,,0,0,,0,,0,0,0,0,,,,,,,,,,,,,,,,,,,0,,,,,,,,,,,,,,,,,,0,0,0,1,1,0,,,,,,,,,,,,,1,4,1,0,0,0,0,0,0,7,0,0,1,0,0,0,1,0,1,0,0,0,0,1,0,0,3,0,0,0,0,0,0,0,0,0,0,0,0,0,0,,,,,,,,,,,,,,,,,,,,,,,,,,,,,,,,,,,,,,,,,,,,,,,,,,,,,,,,,,,,,,,,,,,,,,,,,,,,,,,,,,,,,,,,,,,,,,,,,,,,,,,,,,,,,,,,,,,,,,,,,,,,,,,,,,,,,,,,,,,,,,,,,,,,,,,,,,,,,,,,,,,,,,,,,,,,,,,,,,,,,,,,3,3,4,3,4,4,4,4,3,1,1,0,0,,0,,0,,,1,1,0,,,,,0,,0,,0,,0,,0,,0,,1,0,1,1,0,,0,,1,1,1,1,0,,1,1,1,0,38.18,27.17,0,,1,1,0,0,0,0,0,0,1,0,0,0,0,0,0,0,0,0,0,0,0,1,0,850,D,3,1,1,2,2,1,,,1,5,2,2,0,0,0,0,0,2,3,2,800,0,0,800,800,0,126,126,0,800,800,1,0,0
70004497,1,1,3,1,1,2000,85126930,2770.388175,1,0,5,1,0,1,1,0,1,1,0,1,0,1,1,1,0,0,0,0,0,0,,,,,,,,,,,,,,,,,,,,,,0,1,1,1,0,,,,,,,,,4,,4,,0,2,1,1,,,,,,,,,,,,,,,,,,,,,,,,,,,,,,,,,,,,,,,,,,,,,,,,,,,,,,,,,,,,,,,,,,,,,,,,,,,,,,,,,,,,,,,,,0,0,0,0,,,,,0,0,,1,1,1,D,1,,3,,,,,,,,,,,,,,,,0,0,1,,,,,,,,,,,,,,,,,,0,0,0,0,1,0,,,,,,,,,,,,,0,,0,,,,,,,,0,0,0,0,0,0,1,0,0,0,0,0,0,0,0,0,0,0,0,0,0,0,0,0,0,0,0,0,0,0,0,,,,,,,,,,,,,,,,,,,,,,,,,,,,,,,,,,,,,,,,,,,,,,,,,,,,,,,,,,,,,,,,,,,,,,,,,,,,,,,,,,,,,,,,,,,,,,,,,,,,,,,,,,,,,,,,,,,,,,,,,,,,,,,,,,,,,,,,,,,,,,,,,,,,,,,,,,,,,,,,,,,,,,,,,,,,,,,,,,,,,,,,5,4,5,5,3,R,5,4,4,1,1,1,1,1,,0,1,1,0,1,1,1,0,1,1,0,1,1,0,,0,,0,,1,1,1,1,0,,0,,1,0,0,,0,,0,,0,,1,1,1,1,28.39,27.23,0,,0,,,,,,,0,1,0,0,0,0,0,0,0,1,0,0,0,0,0,0,300,0,1,D,2,1,2,1,,,1,5,4,2,0,0,0,0,0,2,2,2,200,0,0,200,200,0,30,30,0,150,200,1,0,0
70002689,2,3,3,0,1,3000,85110403,3396.1274344,1,1,1,,0,1,1,0,0,0,0,0,0,1,1,D,0,0,0,0,0,0,,,,,,,,,,,,,,,,,,,,,,0,0,0,0,0,,,,,,,,,4,,4,,1,1,0,1,,,,,,,,,,,,,,,,,,,,,,,,,,,,,,,,,,,,,,,,,,,,,,,,,,,,,,,,,,,,,,,,,,,,,,,,,,,,,,,,,,,,,,,,,0,0,0,0,,,,,0,0,,0,,0,0,0,0,,,,,,,,,,,,,,,,,,,0,,,,,,,,,,,,,,,,,,0,1,1,0,0,0,,0,0,3,0,0,0,0,0,0,0,,0,,0,,,,,,,,0,0,0,0,0,0,1,0,1,0,0,0,0,1,1,1,4,0,0,0,0,0,0,0,0,1,0,0,0,0,1,,,,1,,1,,,,,,,,,,,,,10,,,,,,,,,,,,,,,,,,,,,,,,,,,,,,,,,,,,,,,,,,,,,,,,,,,,,,,,,,,,,,,,,,,,,,0,0,0,1,0,1,0,0,0,0,0,0,0,,,,,,,,,,,,,,,,,,,,,,,,,,,,,,,,,,,,,,,,,,,,,,,,,,,,,,,,,,,,,,,,,,,,14,1,0.5,,,,,,,,,,,,,4,3,4,4,3,5,4,4,4,1,1,1,1,1,,0,0,,,0,,0,,,,,0,,0,,0,,0,,1,1,0,,0,,1,1,0,,0,,1,1,0,,0,,1,1,1,0,34.88,28.18,0,,0,,,,,,,0,1,0,0,0,0,0,0,0,0,0,0,0,0,1,0,860,0,2,4,4,2,2,1,,,0,5,3,2,0,0,0,0,0,2,6,4,800,0,0,900,900,0,361,241,0,800,900,1,0,0
70005171,1,1,2,0,1,3000,85124294,1676.5599884,1,0,3,0,0,1,1,1,1,1,0,0,1,0,0,0,0,0,0,0,0,0,,,,,,,,,,,,,,,,,,,,,,0,0,0,0,0,,,,,,,,,4,,4,,0,1,0,0,,,,,,,,,,,,,,,,,,,,,,,,,,,,,,,,,,,,,,,,,,,,,,,,,,,,,,,,,,,,,,,,,,,,,,,,,,,,,,,,,,,,,,,,,0,0,0,0,,,,,0,0,,1,0,0,0,1,,3,,,,,,,,,,,,,,,,1,,1,1,2,0,0,0,0,0,0,0,0,0,2,2,2,2,2,2,0,0,0,0,0,,,,,,,,,,,,,,0,,0,,,,,,,,0,0,0,0,0,0,0,0,0,0,0,0,0,0,0,0,0,0,0,0,0,0,0,0,0,0,0,0,0,0,0,,,,,,,,,,,,,,,,,,,,,,,,,,,,,,,,,,,,,,,,,,,,,,,,,,,,,,,,,,,,,,,,,,,,,,,,,,,,,,,,,,,,,,,,,,,,,,,,,,,,,,,,,,,,,,,,,,,,,,,,,,,,,,,,,,,,,,,,,,,,,,,,,,,,,,,,,,,,,,,,,,,,,,,,,,,,,,,,,,,,,,,,2,1,1,1,1,1,1,1,3,0,0,0,0,,0,,0,,,0,,0,,,,,0,,0,,0,,0,,0,,0,,0,,0,,0,,0,,0,,0,,0,,0,0,0,0,57.31,59.07,0,,1,1,0,0,0,0,0,0,1,0,0,0,0,0,0,0,0,0,0,0,0,1,0,670,0,2,D,2,2,2,1,,4,0,7,2,2,0,0,0,0,0,2,3,D,700,0,0,700,700,0,186,186,0,650,700,1,0,0
70005031,1,1,2,0,2,1000,85079518,1367.4755121,1,1,4,0,0,1,0,0,1,0,0,0,0,0,1,0,0,0,0,0,0,0,,,,,,,,,,,,,,,,,,,,,,0,0,1,1,1,9,2,1,3,2,0,,,3,,2,3,0,2,1,1,,,,,,,,,,,,,,,,,,,,,,,,,,,,,,,,,,,,,,,,,,,,,,,,,,,,,,,,,,,,,,,,,,,,,,,,,,,,,,,,,,,,,,,,,,,,,,0,,0,0,0,,1,0,0,0,1,,3,,,,,,,,,,,,,,,,D,0,1,,,,,,,,,,,,,,,,,,0,0,1,0,0,,,0,0,3,0,0,0,0,0,0,0,,0,,0,,,,,,,,0,0,0,0,0,0,0,0,1,0,1,0,0,1,0,1,5,0,0,0,0,0,0,0,0,1,0,0,0,0,1,,,,1,,1,,,,,,,,,,,,,10,,,,,,,,,,,,,,,,,,,,,,,,,,,,,,,,,,,,,,,,,,,,,,,,,,,,,,,,,,,,,,,,,,,,,,0,0,0,1,0,1,0,0,0,0,0,0,0,,,,,,,,,,,,,,,,,,,,,,,,,,,,,,,,,,,,,,,,,,,,,,,,,,,,,,,,,,,,,,,,,,,,4,1,0.25,,,,,,,,,,,,,4,4,2,5,4,3,3,4,4,1,0,0,0,,0,,1,1,0,0,,1,0,1,1,0,1,1,1,1,1,1,0,,1,1,1,1,0,,1,1,0,,0,,0,,0,,0,,0,1,0,1,34.53,35.43,0,,1,1,2,0,0,0,0,1,1,0,0,0,0,0,0,0,0,0,0,1,0,1,0,1410,200,2,D,D,2,2,1,,,0,7,3,4,1,1,0,0,2,2,2,2,0,1000,400,1400,1400,1,84,78,950,0,1400,2,0,1000
70003386,1,1,4,0,2,2000,85122229,16466.527802,1,1,3,1,0,1,0,0,0,0,0,0,0,0,0,0,0,0,0,0,0,0,,,,,,,,,,,,,,,,,,,,,,0,0,0,1,1,2,3,1,6,4,0,,,3,,3,,0,2,1,1,,,,,,,,,,,,,,,,,,,,,,,,,,,,,,,,,,,,,,,,,,,,,,,,,,,,,,,,,,,,,,,,,,,,,,,,,,,,,,,,,,,,,,,,,,,,,,1,0,1,1,1,0,1,0,1,1,1,,3,,,,,,,,,,,,,,,,1,,1,1,0,0,0,0,0,0,0,0,0,0,1,2,1,1,1,1,0,0,1,0,0,,,,,,,,,,,,,,0,,0,,,,,,,,0,0,0,0,0,0,0,0,1,0,1,0,0,1,0,0,2,0,0,0,0,0,0,0,0,0,0,0,0,0,0,,,,,,,,,,,,,,,,,,,,,,,,,,,,,,,,,,,,,,,,,,,,,,,,,,,,,,,,,,,,,,,,,,,,,,,,,,,,,,,,,,,,,,,,,,,,,,,,,,,,,,,,,,,,,,,,,,,,,,,,,,,,,,,,,,,,,,,,,,,,,,,,,,,,,,,,,,,,,,,,,,,,,,,,,,,,,,,,,,,,,,,,4,4,4,5,3,4,3,4,2,1,0,0,1,0,,,0,,,0,,1,0,1,1,0,1,1,1,0,0,,0,,1,1,1,0,1,0,1,1,0,,1,0,0,,1,0,0,,1,1,0,1,26.17,38.68,0,,1,0,2,0,8,0,0,1,0,0,0,1,0,0,0,1,0,0,0,0,0,1,0,1600,0,4,1,1,1,2,1,,,1,7,2,2,0,0,0,0,0,2,10,6,0,1300,0,1500,1500,0,36,36,1300,0,1500,2,1,1400
70002662,1,2,3,1,3,3000,85073161,3387.9543955,1,0,1,,1,,,,,,,,,,,,,,,,,,,,,,,,,,,,,,,,,,,,,,,1,,0,0,1,6,4,1,3,4,0,,,2,4,2,4,0,1,0,1,1,1,1,1,0,0,0,0,0,0,0,2,3,2,3,2,2,1,2,2,1,2,2,0,,,,,,,,0,0,0,0,0,0,0,0,0,0,,1,0,3,62,3,30,D,40,174,0,2000,,1,40,52,1,,,,,,,,,,,,,,,,,,,,,,,,3,62,3,12,8,2080,40,0,0,0,0,,0,,0,0,0,,0,,0,0,0,0,,,,,,,,,,,,,,,,,,,0,,,,,,,,,,,,,,,,,,0,0,0,0,0,,,,,,,,,,,,,,0,,0,,,,,,,,0,0,0,0,0,0,0,0,0,0,0,0,0,0,0,0,0,0,0,0,0,0,0,0,0,0,0,0,0,0,0,,,,,,,,,,,,,,,,,,,,,,,,,,,,,,,,,,,,,,,,,,,,,,,,,,,,,,,,,,,,,,,,,,,,,,,,,,,,,,,,,,,,,,,,,,,,,,,,,,,,,,,,,,,,,,,,,,,,,,,,,,,,,,,,,,,,,,,,,,,,,,,,,,,,,,,,,,,,,,,,,,,,,,,,,,,,,,,,,,,,,,,,1,1,1,1,3,1,1,1,3,1,0,0,1,0,,,0,,,0,,0,,,,,0,,0,,0,,0,,0,,0,,0,,0,,0,,0,,0,,0,,0,,0,0,0,0,56.92,55.03,0,0,1,0,0,0,0,0,10,0,0,0,0,0,0,1,0,0,0,0,0,0,0,0,2,660,0,1,1,2,2,6,1,,D,0,5,2,2,0,0,0,0,0,2,1,D,0,600,0,700,700,1,361,241,600,50,700,3,0,600
70000795,1,2,3,1,2,3000,85073161,3727.5334201,1,1,1,,0,1,0,0,0,0,0,0,0,0,1,0,0,0,0,0,0,0,,,,,,,,,,,,,,,,,,,,,,0,0,0,1,1,1,3,0,,,,,,3,,2,D,2,2,1,1,,,,,,,,,,,,,,,,,,,,,,,,,,,,,,,,,,,,,,,,,,,,,,,,,,,,,,,,,,,,,,,,,,,,,,,,,,,,,,,,,,,,,,,,,,,,,,0,,0,0,0,,0,,0,0,0,0,,,,,,,,,,,,,,,,,,,0,,,,,,,,,,,,,,,,,,0,0,1,0,0,,,0,0,3,0,0,0,0,0,0,0,,1,4,0,,,,,,,,0,0,0,0,0,0,0,0,0,0,1,0,0,1,0,1,1,0,0,0,0,0,0,0,0,0,0,1,0,0,1,,,,1,,,,1,,,,,,,,,,,,,,,12,,,,,,,,,,,,,,,,,,,,,,,,,,,,,,,,,,,,,,,,,,,,,,,,,,,,,,,,,,,,,,,,,,,,,,,,,,,,,,,,,,,,,,,,,,,,,,,,,,,,,,,,,,,,,,,,,,,,,,0,0,0,1,0,0,0,1,2,2,2,2,0,,,,,,,,,,,,,,,,,,,,,,,,,,,,1,1,4,4,4,4,1,4,3,1,1,3,1,1,1,1,1,,0,0,,,0,,1,1,0,,,0,,0,,0,,0,,0,,1,1,0,,1,1,0,,0,,1,1,1,1,0,,1,0,0,0,31.64,57.62,0,,1,1,2,0,0,0,0,1,1,0,0,0,0,0,0,0,0,0,0,0,0,1,0,1320,0,3,1,3,2,2,1,,5,0,5,3,3,0,0,0,3,3,2,3,D,0,900,400,1300,1300,1,144,144,900,0,1300,2,0,900
70000949,2,3,1,1,1,3000,85106924,1597.7298369,1,1,1,,0,1,1,0,0,0,0,0,0,1,0,0,0,0,0,0,0,0,,,,,,,,,,,,,,,,,,,,,,0,0,0,1,0,,,,,,,,,4,,D,,2,1,0,0,,,,,,,,,,,,,,,,,,,,,,,,,,,,,,,,,,,,,,,,,,,,,,,,,,,,,,,,,,,,,,,,,,,,,,,,,,,,,,,,,,,,,,,,,0,0,0,0,0,,,,0,0,,0,,0,0,1,,2,1,0,0,0,0,1,0,0,0,0,0,0,0,0,0,1,,1,1,0,0,5,0,0,0,0,0,0,D,2,2,2,2,2,2,0,0,0,1,0,,,0,0,3,4,0,0,0,0,0,0,,1,3,1,0,0,0,0,0,6,0,0,0,1,0,0,0,0,0,0,0,0,0,0,1,0,2,2,0,0,1,0,0,0,0,0,0,0,0,0,0,1,D,,,1,,1,1,,,,,,,,3,,,,,,,,,,,,,,,,,,,,,,D,0,0,1,0,1,1,0,0,0,0,0,0,,,,,,,,,,,,,,,,,,,,,,,,,,,,,,,,,,,,,,,,,,,,,,,,,,,,,,,,,,,,,,,,,,,,,,,,,,,,,,,,,,,,,,,,,,,,,,,,,,,,,,,,,,,,144,1,1,,,,,,,,,,,,,,,,,,,,,,,,,4,4,2,3,3,5,4,4,4,1,1,0,1,0,,,1,1,0,0,,1,0,0,,,0,,0,,0,,0,,0,,0,,0,,1,1,0,,1,0,1,1,1,1,0,,1,1,1,0,43.67,26.69,0,,1,1,0,0,0,0,0,0,1,0,0,0,0,0,0,0,0,0,0,0,0,1,0,850,0,1,1,1,2,2,1,,,0,7,4,4,1,0,2,0,0,2,2,2,800,0,0,800,800,0,126,126,0,800,800,1,0,0
70003895,1,1,2,0,1,2000,85131073,1775.6912202,1,0,2,1,0,1,0,0,1,0,0,0,0,1,0,0,0,0,0,0,0,0,,,,,,,,,,,,,,,,,,,,,,0,1,1,0,1,2,2,0,,,,,,3,,2,3,1,1,0,0,,,,,,,,,,,,,,,,,,,,,,,,,,,,,,,,,,,,,,,,,,,,,,,,,,,,,,,,,,,,,,,,,,,,,,,,,,,,,,,,,,,,,,,,,0,0,0,0,,,,,1,1,0,0,,0,1,1,,3,,,,,,,,,,,,,,,,0,0,1,,,,,,,,,,,,,,,,,,0,0,0,1,0,,,,,,,,,,,,,,0,,0,,,,,,,,0,0,1,0,0,0,0,0,1,0,0,0,0,1,0,0,4,0,0,0,0,0,0,0,0,0,0,0,0,0,0,,,,,,,,,,,,,,,,,,,,,,,,,,,,,,,,,,,,,,,,,,,,,,,,,,,,,,,,,,,,,,,,,,,,,,,,,,,,,,,,,,,,,,,,,,,,,,,,,,,,,,,,,,,,,,,,,,,,,,,,,,,,,,,,,,,,,,,,,,,,,,,,,,,,,,,,,,,,,,,,,,,,,,,,,,,,,,,,,,,,,,,,4,4,4,4,5,4,5,4,4,1,1,1,0,,1,0,0,,,0,,0,,,,,1,1,1,1,1,1,0,,1,1,0,,0,,1,1,1,0,1,0,0,,0,,1,0,1,1,1,0,33.21,19.63,0,,1,1,0,0,0,0,0,0,1,0,0,0,0,0,0,0,0,0,0,1,0,1,0,670,230,2,D,2,2,2,1,,,0,5,2,5,1,D,D,0,D,2,2,2,700,0,0,700,700,0,162,162,0,650,700,1,0,0
70004771,1,1,3,1,2,2000,85101539,3055.1467728,1,0,1,,0,1,0,0,0,0,0,D,1,0,1,0,0,0,0,0,0,0,,,,,,,,,,,,,,,,,,,,,,0,0,1,1,0,,,,,,,,,4,,3,,0,2,1,1,,,,,,,,,,,,,,,,,,,,,,,,,,,,,,,,,,,,,,,,,,,,,,,,,,,,,,,,,,,,,,,,,,,,,,,,,,,,,,,,,,,,,,,,,,,,,,0,,0,0,0,,0,,0,0,0,0,,,,,,,,,,,,,,,,,,,0,,,,,,,,,,,,,,,,,,0,0,0,1,0,,,,,,,,,,,,,,0,,0,,,,,,,,0,0,0,0,0,0,0,0,1,0,0,0,0,1,0,0,1,0,0,0,0,0,0,0,0,0,0,0,0,0,0,,,,,,,,,,,,,,,,,,,,,,,,,,,,,,,,,,,,,,,,,,,,,,,,,,,,,,,,,,,,,,,,,,,,,,,,,,,,,,,,,,,,,,,,,,,,,,,,,,,,,,,,,,,,,,,,,,,,,,,,,,,,,,,,,,,,,,,,,,,,,,,,,,,,,,,,,,,,,,,,,,,,,,,,,,,,,,,,,,,,,,,,3,1,3,4,3,1,2,1,3,1,0,0,1,1,,0,0,,,0,,0,,,,,0,,0,,1,1,0,,0,,0,,0,,0,,0,,0,,0,,0,,0,,0,0,0,0,41.85,52.5,0,,1,0,2,0,0,0,0,1,0,0,0,0,0,0,0,0,0,0,0,1,0,1,0,1600,230,2,1,1,1,2,1,,,1,5,4,4,1,1,0,0,2,2,4,5,0,1200,400,1500,1500,1,120,48,1150,0,1500,2,0,1200
70003061,1,1,2,0,2,1000,85108318,2605.9257332,1,1,3,1,0,1,0,0,0,0,0,0,0,1,1,1,0,0,0,0,0,0,,,,,,,,,,,,,,,,,,,,,,0,0,1,1,1,1,1,1,3,1,1,8,1,3,,D,,0,2,1,1,,,,,,,,,,,,,,,,,,,,,,,,,,,,,,,,,,,,,,,,,,,,,,,,,,,,,,,,,,,,,,,,,,,,,,,,,,,,,,,,,,,,,,,,,,,,,,1,0,1,0,0,,0,,0,0,1,,1,0,0,0,0,5,0,0,0,0,5,0,0,0,0,0,0,0,1,,,,,,,,,,,,,,,,,,0,0,1,1,0,,,0,0,3,4,0,0,0,0,0,0,,1,2,0,,,,,,,,0,0,0,0,0,0,0,0,1,0,0,0,0,1,0,2,2,0,0,0,0,0,0,0,0,1,0,0,0,0,1,,,,1,,1,,,,,,,,,,,,,10,10,,,,,,,,,,,,,,,,,,,,,,,,,,,,,,,,,,,,,,,,,,,,,,,,,,,,,,,,,,,,,,,,,,,,,0,0,0,1,0,0,0,0,0,0,0,0,0,0,0,0,0,0,1,0,0,0,0,0,0,0,,,,,,,,,,,,,,,,,,,,,,,,,,,,,,,,,,,,,,,,,,,,,,,,,,,,,,,12,2,1,52.2,4,1,,,,,,,,,,4,2,4,5,4,4,5,4,4,1,1,1,1,0,,,0,,,0,,1,1,0,,,0,,0,,0,,0,,1,1,0,,0,,1,1,0,,0,,0,,0,,0,,1,1,1,0,36.59,18.36,0,,1,0,2,0,0,0,0,1,0,0,0,0,0,0,0,0,0,0,0,0,0,1,0,740,0,4,3,3,2,2,1,,6,0,5,4,2,0,0,0,0,0,2,5,D,0,700,0,700,1000,1,174,66,1000,0,1000,2,0,1000