Caseid_PUB,C_RTYPE,C_RESPTYPE,C_INTAGE_PUB,ORGSAMPINFO_SEX,ORGSAMPINFO_BSTATUS,A_STRATA,A_PSU_PUB,WGT1_BENEFINLE3,WGT1_BENEFINLE15,WGT1_BENEFINLE12,WGT1_BENEFINL,B1,B3,B24_I,B25_A,B25_B,B25_C,B25_D,B25_F,B25_G,B25_H,B25_I,B25_J,B25_L,B25_M,B25_N,B25_O,B26,B28,B29_A,B29_B,B29_C,B29_D,B29_E,B29_F,B29_G,B29_H,B30,B37,B37A,B38,B39,B40,B41,B42,B43,B44,B45,B46,B47_A,B47_B,B47_C,B47_D,C_MAINCONCOLDIAGGRP_I_PUB,C_ADULTCHILD_ONSET_I,C_WRKDWHENLIM,C_EVRWORKED,C5A_1,C7_1,C10_1,C18_1,C20A_1,C20B_1,C20C_1,C20D_1,C20H_1,C22,C27,C39_A,C39_B,C39_C,C39_D,C39_E,C39_F,C39_G,C39_H,C39_I,C39_J,C39_K,C39_L,C_MAINCURJOBSOC_PUB,C_MAINCURJOBNAICS_PUB,C_TOTCURMNTHPAY_I_PUB,C_MNTHSMAINCURJOB_PUB,C_MAINCURJOBREPSSA_PUB,C_TOTCURWKHRS_I_PUB,C_TOTCURHRMNTH_I_PUB,D1,D6YR_M_PUB,D8YR_M_PUB,D15_M_PUB,D16_M_PUB,D17_M_PUB,D18_M_PUB,D25A,D25_A,D25_B,D25_C,D25_D,D25_E,D25_F,D25_G,D26_A,D26_B,D26_C,D26_D,D26_E,D26_F,D26_G,D26_H,D26_I,D27,D28,D29,D30,C_MAINJOB2003SOC_PUB,C_MAINJOB2003NAICS_PUB,C_MAINJOBMNTHPAY2003_PUB,C_MNTHSMAIN2003JOB,C_TOT2003PAY_PUB,C_TOTHRS2003_PUB,C_USWKHR2003_PUB,E3,E5,E7,E9,E12,E15,E16,E17,E19,E20_A,E20_B,E20_C,E20_D,E21,E22,E26,E27,E28_1,E28_2,E28_3,E28_4,E28_5,E28_6,E28_7,E28_8,E28_9,E28_10,E29,E30_1,E30_2,E30_3,E30_4,E30_5,E30_6,E30_7,E30_8,E30_9,E30_10,E31,E32_1,E32_2,E32_3,E32_4,E32_5,E32_6,E32_7,E32_8,E32_9,E32_10,E33,E34,E35,C_AWARETTW,F31_1,F31_2,F31_3,F31_4,F31_5,F31_6,F32,F33_A,F33_B,F33_C,F33_D,G1,G10,G15,G19,G23,G26,G29,G53_1,G53_2,G53_3,G53_4,G53_5,G53_6,G53_7,G53_8,G53_9,G54,G57,G58,G59,G60,G61_1,G61_2,G61_3,G61_4,G61_5,G61_6,G61_7,C_EVRUSESVR,C_EVRUSEWEL,C_EVRUSESMENH,C_EVRUSEOSTAT,C_EVRUSEPRIV,C_EVRUSEOTH,C_EVRUSESCHOOL,C_EVRUSEUNEMPLY,C_EVRUSECLINIC,C_EVRUSEREHAB,C_EVRUSEOTHMED,C_EMPPROVUNKWN,C_MEDPROVUNKWN,C_EVRUSEDSERV,C_EVRUSEEMPLOY,C_NUMPROV2003_PUB,C_NUMPROVEVUSED_PUB,C_USESVR2003,C_USEWEL2003,C_USESMENH2003,C_USEOTHST2003,C_USEPRIV2003,C_USEOTHNONST2003,C_USESCHOOL2003,C_USEUNEMP2003,C_USECLINIC2003,C_USEREHAB2003,C_USEOTHMED2003,C_EMPUNKWN2003,C_MEDUNKWN2003,C_SERVUSE2003,C_PHYTH2003,C_OCCTHER2003,C_SPCHTHER2003,C_MEDPROC2003,C_EQUIP2003,C_COUN2003,C_GRPTH2003,C_WRKAS2003,C_FINDJOB2003,C_JOBTRN2003,C_JOBMOD2003,C_JOBCCH2003,C_OTHERSERV2003,C_TOTSERCOST2003_PUB,C_TOTMONEYENS2003,C_PROVTYPE2003_01_1,C_PROVTYPE2003_03_1,C_PROVTYPE2003_04_1,C_PROVTYPE2003_05_1,C_PROVTYPE2003_07_1,C_PROVTYPE2003_10_1,C_PROVTYPE2003_10_2,C_PROVTYPE2003_10_3,C_PROVTYPE2003_11_1,C_PROVTYPE2003_12_1,C_PHYTH2003_01_1,C_OCCTH2003_01_1,C_SPCHTH2003_01_1,C_MED2003_01_1,C_EQUIP2003_01_1,C_COUN2003_01_1,C_GRPTH2003_01_1,C_WRKAS2003_01_1,C_FNDJOB2003_01_1,C_JOBTRN2003_01_1,C_JOBMD2003_01_1,C_JOBCCH2003_01_1,C_OTHR2003_01_1,C_PHYTH2003_03_1,C_OCCTH2003_03_1,C_SPCHTH2003_03_1,C_MED2003_03_1,C_EQUIP2003_03_1,C_COUN2003_03_1,C_GRPTH2003_03_1,C_WRKAS2003_03_1,C_FNDJOB2003_03_1,C_JOBTRN2003_03_1,C_JOBMD2003_03_1,C_JOBCCH2003_03_1,C_OTHR2003_03_1,C_PHYTH2003_04_1,C_OCCTH2003_04_1,C_SPCHTH2003_04_1,C_MED2003_04_1,C_EQUIP2003_04_1,C_COUN2003_04_1,C_GRPTH2003_04_1,C_WRKAS2003_04_1,C_FNDJOB2003_04_1,C_JOBTRN2003_04_1,C_JOBMD2003_04_1,C_JOBCCH2003_04_1,C_OTHR2003_04_1,C_PHYTH2003_05_1,C_OCCTH2003_05_1,C_SPCHTH2003_05_1,C_MED2003_05_1,C_EQUIP2003_05_1,C_COUN2003_05_1,C_GRPTH2003_05_1,C_WRKAS2003_05_1,C_FNDJOB2003_05_1,C_JOBTRN2003_05_1,C_JOBMD2003_05_1,C_JOBCCH2003_05_1,C_OTHR2003_05_1,C_PHYTH2003_07_1,C_OCCTH2003_07_1,C_SPCHTH2003_07_1,C_MED2003_07_1,C_EQUIP2003_07_1,C_COUN2003_07_1,C_GRPTH2003_07_1,C_WRKAS2003_07_1,C_FNDJOB2003_07_1,C_JOBTRN2003_07_1,C_JOBMD2003_07_1,C_JOBCCH2003_07_1,C_OTHR2003_07_1,C_PHYTH2003_10_1,C_OCCTH2003_10_1,C_SPCHTH2003_10_1,C_MED2003_10_1,C_EQUIP2003_10_1,C_COUN2003_10_1,C_GRPTH2003_10_1,C_WRKAS2003_10_1,C_FNDJOB2003_10_1,C_JOBTRN2003_10_1,C_JOBMD2003_10_1,C_JOBCCH2003_10_1,C_OTHR2003_10_1,C_PHYTH2003_10_2,C_OCCTH2003_10_2,C_SPCHTH2003_10_2,C_MED2003_10_2,C_EQUIP2003_10_2,C_COUN2003_10_2,C_GRPTH2003_10_2,C_WRKAS2003_10_2,C_FNDJOB2003_10_2,C_JOBTRN2003_10_2,C_JOBMD2003_10_2,C_JOBCCH2003_10_2,C_OTHR2003_10_2,C_PHYTH2003_10_3,C_OCCTH2003_10_3,C_SPCHTH2003_10_3,C_MED2003_10_3,C_EQUIP2003_10_3,C_COUN2003_10_3,C_GRPTH2003_10_3,C_WRKAS2003_10_3,C_FNDJOB2003_10_3,C_JOBTRN2003_10_3,C_JOBMD2003_10_3,C_JOBCCH2003_10_3,C_OTHR2003_10_3,C_PHYTH2003_11_1,C_OCCTH2003_11_1,C_SPCHTH2003_11_1,C_MED2003_11_1,C_EQUIP2003_11_1,C_COUN2003_11_1,C_GRPTH2003_11_1,C_WRKAS2003_11_1,C_FNDJOB2003_11_1,C_JOBTRN2003_11_1,C_JOBMD2003_11_1,C_JOBCCH2003_11_1,C_OTHR2003_11_1,C_PHYTH2003_12_1,C_OCCTH2003_12_1,C_SPCHTH2003_12_1,C_MED2003_12_1,C_EQUIP2003_12_1,C_COUN2003_12_1,C_GRPTH2003_12_1,C_WRKAS2003_12_1,C_FNDJOB2003_12_1,C_JOBTRN2003_12_1,C_JOBMD2003_12_1,C_JOBCCH2003_12_1,C_OTHR2003_12_1,C_NUMPROVCONT_01_1,C_PROVUSE2003_01_1,C_DURPROVVISIT_01_1,C_PROVPAYSERV_01_1,C_NOONEPAYSERV_01_1,C_SELFFAMPAYSERV_01_1,C_ENPAYSERV_01_1,C_MEDICAREPAYSERV_01_1,C_MEDICAIDPAYSERV_01_1,C_EMPLYPAYSERV_01_1,C_NONPROFPAYSERV_01_1,C_WORKCOMPPAYSERV_01_1,C_DISINSURPAYSERV_01_1,C_OTHERPAYSERV_01_1,C_AGENCYPAYSERV_01_1,C_INSURPAYSERV_01_1,C_SCHOOLPAYSERV_01_1,C_SERCOST2003_01_1,C_NUMPROVCONT_03_1,C_PROVUSE2003_03_1,C_DURPROVVISIT_03_1,C_PROVPAYSERV_03_1,C_NOONEPAYSERV_03_1,C_SELFFAMPAYSERV_03_1,C_ENPAYSERV_03_1,C_MEDICAREPAYSERV_03_1,C_MEDICAIDPAYSERV_03_1,C_EMPLYPAYSERV_03_1,C_NONPROFPAYSERV_03_1,C_WORKCOMPPAYSERV_03_1,C_DISINSURPAYSERV_03_1,C_OTHERPAYSERV_03_1,C_AGENCYPAYSERV_03_1,C_INSURPAYSERV_03_1,C_SCHOOLPAYSERV_03_1,C_SERCOST2003_03_1,C_NUMPROVCONT_04_1,C_PROVUSE2003_04_1,C_DURPROVVISIT_04_1,C_PROVPAYSERV_04_1,C_NOONEPAYSERV_04_1,C_SELFFAMPAYSERV_04_1,C_ENPAYSERV_04_1,C_MEDICAREPAYSERV_04_1,C_MEDICAIDPAYSERV_04_1,C_EMPLYPAYSERV_04_1,C_NONPROFPAYSERV_04_1,C_WORKCOMPPAYSERV_04_1,C_DISINSURPAYSERV_04_1,C_OTHERPAYSERV_04_1,C_AGENCYPAYSERV_04_1,C_INSURPAYSERV_04_1,C_SCHOOLPAYSERV_04_1,C_SERCOST2003_04_1,C_NUMPROVCONT_05_1,C_PROVUSE2003_05_1,C_DURPROVVISIT_05_1,C_PROVPAYSERV_05_1,C_NOONEPAYSERV_05_1,C_SELFFAMPAYSERV_05_1,C_ENPAYSERV_05_1,C_MEDICAREPAYSERV_05_1,C_MEDICAIDPAYSERV_05_1,C_EMPLYPAYSERV_05_1,C_NONPROFPAYSERV_05_1,C_WORKCOMPPAYSERV_05_1,C_DISINSURPAYSERV_05_1,C_OTHERPAYSERV_05_1,C_AGENCYPAYSERV_05_1,C_INSURPAYSERV_05_1,C_SCHOOLPAYSERV_05_1,C_SERCOST2003_05_1,C_NUMPROVCONT_07_1,C_PROVUSE2003_07_1,C_DURPROVVISIT_07_1,C_PROVPAYSERV_07_1,C_NOONEPAYSERV_07_1,C_SELFFAMPAYSERV_07_1,C_ENPAYSERV_07_1,C_MEDICAREPAYSERV_07_1,C_MEDICAIDPAYSERV_07_1,C_EMPLYPAYSERV_07_1,C_NONPROFPAYSERV_07_1,C_WORKCOMPPAYSERV_07_1,C_DISINSURPAYSERV_07_1,C_OTHERPAYSERV_07_1,C_AGENCYPAYSERV_07_1,C_INSURPAYSERV_07_1,C_SCHOOLPAYSERV_07_1,C_SERCOST2003_07_1,C_NUMPROVCONT_10_1,C_PROVUSE2003_10_1,C_DURPROVVISIT_10_1,C_PROVPAYSERV_10_1,C_NOONEPAYSERV_10_1,C_SELFFAMPAYSERV_10_1,C_ENPAYSERV_10_1,C_MEDICAREPAYSERV_10_1,C_MEDICAIDPAYSERV_10_1,C_EMPLYPAYSERV_10_1,C_NONPROFPAYSERV_10_1,C_WORKCOMPPAYSERV_10_1,C_DISINSURPAYSERV_10_1,C_OTHERPAYSERV_10_1,C_AGENCYPAYSERV_10_1,C_INSURPAYSERV_10_1,C_SCHOOLPAYSERV_10_1,C_SERCOST2003_10_1,C_NUMPROVCONT_10_2,C_PROVUSE2003_10_2,C_DURPROVVISIT_10_2,C_PROVPAYSERV_10_2,C_NOONEPAYSERV_10_2,C_SELFFAMPAYSERV_10_2,C_ENPAYSERV_10_2,C_MEDICAREPAYSERV_10_2,C_MEDICAIDPAYSERV_10_2,C_EMPLYPAYSERV_10_2,C_NONPROFPAYSERV_10_2,C_WORKCOMPPAYSERV_10_2,C_DISINSURPAYSERV_10_2,C_OTHERPAYSERV_10_2,C_AGENCYPAYSERV_10_2,C_INSURPAYSERV_10_2,C_SCHOOLPAYSERV_10_2,C_SERCOST2003_10_2,C_NUMPROVCONT_10_3,C_PROVUSE2003_10_3,C_DURPROVVISIT_10_3,C_PROVPAYSERV_10_3,C_NOONEPAYSERV_10_3,C_SELFFAMPAYSERV_10_3,C_ENPAYSERV_10_3,C_MEDICAREPAYSERV_10_3,C_MEDICAIDPAYSERV_10_3,C_EMPLYPAYSERV_10_3,C_NONPROFPAYSERV_10_3,C_WORKCOMPPAYSERV_10_3,C_DISINSURPAYSERV_10_3,C_OTHERPAYSERV_10_3,C_AGENCYPAYSERV_10_3,C_INSURPAYSERV_10_3,C_SCHOOLPAYSERV_10_3,C_SERCOST2003_10_3,C_NUMPROVCONT_11_1,C_PROVUSE2003_11_1,C_DURPROVVISIT_11_1,C_PROVPAYSERV_11_1,C_NOONEPAYSERV_11_1,C_SELFFAMPAYSERV_11_1,C_ENPAYSERV_11_1,C_MEDICAREPAYSERV_11_1,C_MEDICAIDPAYSERV_11_1,C_EMPLYPAYSERV_11_1,C_NONPROFPAYSERV_11_1,C_WORKCOMPPAYSERV_11_1,C_DISINSURPAYSERV_11_1,C_OTHERPAYSERV_11_1,C_AGENCYPAYSERV_11_1,C_INSURPAYSERV_11_1,C_SCHOOLPAYSERV_11_1,C_SERCOST2003_11_1,C_NUMPROVCONT_12_1,C_PROVUSE2003_12_1,C_DURPROVVISIT_12_1,C_PROVPAYSERV_12_1,C_NOONEPAYSERV_12_1,C_SELFFAMPAYSERV_12_1,C_ENPAYSERV_12_1,C_MEDICAREPAYSERV_12_1,C_MEDICAIDPAYSERV_12_1,C_EMPLYPAYSERV_12_1,C_NONPROFPAYSERV_12_1,C_WORKCOMPPAYSERV_12_1,C_DISINSURPAYSERV_12_1,C_OTHERPAYSERV_12_1,C_AGENCYPAYSERV_12_1,C_INSURPAYSERV_12_1,C_SCHOOLPAYSERV_12_1,C_SERCOST2003_12_1,I1_I,I2,I3,I4,I5,I6,I7,I8,I9_I,I10,I11,I12,I17_I,I18_I,I19_I,I21_I,I22_I,I23_I,I25_I,I26_I,I29_I,I30_I,I31_I,I32_1,I32_2,I32_5,I33_I,I34_I,I35_I,I36_I,I37_I,I38_I,I39_I,I40_I,I41_I,I42_I,I43_I,I44_I,I45_I,I46_I,I47_I,I48_I,I49_I,I50_I,I51_I,I52_I,I53_I,I54_I,I55_I,I56_I,I57_I,I58_I,I59_I,I60_I,I61_I,C_EQUIPFUNCLIM_I,C_PCS8TOT_I,C_MCS8TOT_I,CAGESCORE_INDICATOR_I,J3,J8,J10,J11_1,J11_2,J11_7,J11_8,J11_9,J11_10_PUB,J13,C_CURMEDICARE,C_CURMEDICAID,C_CURMILINSUR,C_CURPRIVEMP,C_CURPRIVSP,C_CURPRIVSELF,C_CUROTHERINSUR,C_CURNOINSUR,INCSOURCE1_PUB,INCSOURCE2_PUB,INCSOURCE3_PUB,INCSOURCE4_PUB,INCSOURCE5_PUB,INCSOURCE6_PUB,INCSOURCE7_PUB,C_LSTMNTHPAY_PUB,N_SSILASTMNTH_PUB,C_TOTGOVCASHBEN_PUB,C_TOTNONCASHBEN_PUB,L3_I_PUB,L4_PUB,L5_PUB,L8_I_PUB,L11_I_PUB,L12_PUB,L15,C_NUMADULTHH_PUB,L24_PUB,C_COHAB_I,C_RACE_I_PUB,C_BMI_CAT_I,C_HHSIZE_PUB,C_NUMOWNCHILDHH_PUB,C_NUMNONOWNCHILDHH_PUB,C_NUMOWNCHILDOHH_PUB,C_NUMCHILDHH_PUB,C_NUMOWNCHILD_PUB,C_FEDPOVERTYLEVEL_CAT1,C_HHINC2003_PUB,NEW_DEPENLASTMNTH_PUB,NEW_SSDILASTMNTH_PUB,NEW_TOTSSBENLASTMNTH_PUB,N_BENABSOFEARN_ATINT_PUB,N_MCAID_ATINT,N_MCARE_ATINT,N_MTHSEARLENT_PUB,N_MTHSRECENT_PUB,N_SSDI_ATINT_PUB,N_SSI_ATINT_PUB,N_TOTSSBEN_ATINT_PUB,N_BENSTATATINT2,N_SSDINOMCR_ATINT,N_PIAATINT_PUB
40000498,2,3,2,1,2,3000,85095941,0,882.65075534,0,489.76267417,1,0,0,1,1,0,0,0,0,0,0,1,1,1,0,0,0,1,0,1,0,0,0,0,0,0,0,0,,0,,,,,,,,,3,,1,4,2,1,0,1,,,,,,,,,,,,,,,,,,,,,,,,,,,,,,,,,,,,,,,,,,,,,,,,,,,,,,,,,,,,,,,,,,,,,,,0,,0,1,0,,0,,0,0,,,,,,,,,,,,,,,,,,,,,,,,,,,,,,,,,,,,,,0,,,,,,,,,,,,0,0,0,0,0,,,,,,,,,,,,,,0,,0,,,,,,,,0,0,0,0,0,0,0,0,0,0,0,0,0,0,0,0,0,0,0,0,0,0,0,0,0,0,0,0,0,0,0,,,,,,,,,,,,,,0,0,,,,,,,,,,,,,,,,,,,,,,,,,,,,,,,,,,,,,,,,,,,,,,,,,,,,,,,,,,,,,,,,,,,,,,,,,,,,,,,,,,,,,,,,,,,,,,,,,,,,,,,,,,,,,,,,,,,,,,,,,,,,,,,,,,,,,,,,,,,,,,,,,,,,,,,,,,,,,,,,,,,,,,,,,,,,,,,,,,,,,,,,,,,,,,,,,,,,,,,,,,,,,,,,,,,,,,,,,,,,,,,,,,,,,,,,,,,,,,,,,,,,,,,,,,,,,,,,,,,,,,,,,,,,,,,,,,,,,,,,,,,,,,,,,,,,,,,,,,,,,,,,,,,,,,,,,,,,,,,,,5,4,4,5,4,4,5,4,3,1,1,1,0,,,0,,,0,,0,,,,,,0,,0,,0,,0,,0,,0,,0,,0,,0,,1,1,1,1,1,1,0,,1,1,0,0,29.91,21.61,0,0,,1,1,0,0,0,0,0,0,1,1,0,0,0,0,0,0,0,0,0,0,1,0,1,0,0,740,D,2,4,4,2,6,13,0,1,1,0,5,2,1,0,0,0,0,0,1,D,0,700,700,700,,1,72,72,750,0,700,2,0,1400
40004879,1,1,2,1,3,2000,85122227,0,0,0,778.86764953,1,1,0,1,1,0,0,0,0,0,0,0,D,1,0,0,0,1,0,0,0,0,0,0,1,0,D,1,1,0,,,,,,,,,2,2,2,2,0,2,1,1,,,,,,,,,,,,,,,,,,,,,,,,,,,,,,,,,,,,,,,,,,,,,,,,,,,,,,,,,,,,,,,,,,M,M,M,M,,M,M,M,0,0,,0,,0,0,,,,,,,,,,,,,,,,,,,,,,,,,,,,,,,,,,,,,,0,,,,,,,,,,,,D,0,0,1,1,0,,,,,,,,,,,,,0,,0,,,,,,,,0,0,0,0,0,0,1,0,0,0,0,0,0,1,D,0,0,0,0,0,0,0,0,0,0,0,0,0,0,0,0,,,,,,,,,,,,,,0,0,,,,,,,,,,,,,,,,,,,,,,,,,,,,,,,,,,,,,,,,,,,,,,,,,,,,,,,,,,,,,,,,,,,,,,,,,,,,,,,,,,,,,,,,,,,,,,,,,,,,,,,,,,,,,,,,,,,,,,,,,,,,,,,,,,,,,,,,,,,,,,,,,,,,,,,,,,,,,,,,,,,,,,,,,,,,,,,,,,,,,,,,,,,,,,,,,,,,,,,,,,,,,,,,,,,,,,,,,,,,,,,,,,,,,,,,,,,,,,,,,,,,,,,,,,,,,,,,,,,,,,,,,,,,,,,,,,,,,,,,,,,,,,,,,,,,,,,,,,,,,,,,,,,,,,,,,,,,,,,,,3,5,4,5,4,D,4,4,4,0,1,1,1,0,0,0,,,0,,1,1,1,1,0,0,1,1,1,1,0,,0,,1,1,1,1,1,1,0,,1,0,0,,1,1,0,,0,,1,1,1,1,27.13,33.47,0,0,,1,1,2,0,0,0,0,D,1,1,0,0,0,0,0,0,0,0,0,0,0,0,1,0,100,580,0,3,D,D,2,2,1,,2,3,0,7,4,2,0,0,1,0,1,2,D,0,500,600,600,1,1,108,108,500,100,600,3,0,500
40005748,1,1,2,1,1,1000,85121188,1406.8890548,0,0,741.25356736,1,1,0,1,0,0,0,0,1,1,0,1,0,0,0,0,0,0,,,,,,,,,0,D,,0,,,,,,,,,3,,3,,1,2,0,1,,,,,,,,,,,,,,,,,,,,,,,,,,,,,,,,,,,,,,,,,,,,,,,,,,,,,,,,,,,,,,,,,,0,0,0,0,,,,,0,0,,0,,0,0,,,,,,,,,,,,,,,,,,,,,,,,,,,,,,,,,,,,,,0,,,,,,,,,,,,0,0,0,1,1,0,,,,,,,,,,,,,0,,1,0,0,0,0,0,0,7,0,0,1,0,0,0,1,0,1,0,0,0,0,1,0,0,2,0,0,0,0,0,0,0,0,0,0,0,0,0,0,,,,,,,,,,,,,,0,0,,,,,,,,,,,,,,,,,,,,,,,,,,,,,,,,,,,,,,,,,,,,,,,,,,,,,,,,,,,,,,,,,,,,,,,,,,,,,,,,,,,,,,,,,,,,,,,,,,,,,,,,,,,,,,,,,,,,,,,,,,,,,,,,,,,,,,,,,,,,,,,,,,,,,,,,,,,,,,,,,,,,,,,,,,,,,,,,,,,,,,,,,,,,,,,,,,,,,,,,,,,,,,,,,,,,,,,,,,,,,,,,,,,,,,,,,,,,,,,,,,,,,,,,,,,,,,,,,,,,,,,,,,,,,,,,,,,,,,,,,,,,,,,,,,,,,,,,,,,,,,,,,,,,,,,,,,,,,,,,,4,4,4,6,3,4,4,4,5,1,1,1,0,,,1,1,0,0,,1,1,1,1,0,0,1,1,0,,0,,1,1,1,1,1,1,1,1,1,1,1,1,1,1,1,1,1,1,0,,1,1,0,1,27.01,31.72,0,0,,1,1,0,0,0,0,0,0,1,1,0,0,0,0,0,0,0,0,0,0,1,0,1,0,100,790,140,1,D,2,2,6,1,,1,,0,5,3,1,0,0,2,0,2,2,1,110,500,800,800,1,1,144,138,550,150,800,3,0,500
40007067,1,1,2,1,3,3000,85074273,0,0,0,778.86764953,1,1,1,,,,,,,,,,,,,,,,,,,,,,,,1,0,,0,,,,,,,,,1,4,4,,3,2,0,1,1,0,1,2,1,1,1,1,0,0,0,2,4,4,4,4,2,2,2,2,1,4,4,1,99,2,36,4,23,100,0,2000,,0,23,30,1,,,,,,,,,,,,,,,,,,,,,,1,99,2,12,7,690,23,M,M,M,M,,M,M,M,0,1,1,0,,0,0,,,,,,,,,,,,,,,,,,,,,,,,,,,,,,,,,,,,,,0,,,,,,,,,,,,0,0,0,0,0,,,,,,,,,,,,,,0,,0,,,,,,,,0,0,0,0,0,0,0,0,0,0,0,0,0,0,0,0,0,0,0,0,0,0,0,0,0,0,0,0,0,0,0,,,,,,,,,,,,,,0,0,,,,,,,,,,,,,,,,,,,,,,,,,,,,,,,,,,,,,,,,,,,,,,,,,,,,,,,,,,,,,,,,,,,,,,,,,,,,,,,,,,,,,,,,,,,,,,,,,,,,,,,,,,,,,,,,,,,,,,,,,,,,,,,,,,,,,,,,,,,,,,,,,,,,,,,,,,,,,,,,,,,,,,,,,,,,,,,,,,,,,,,,,,,,,,,,,,,,,,,,,,,,,,,,,,,,,,,,,,,,,,,,,,,,,,,,,,,,,,,,,,,,,,,,,,,,,,,,,,,,,,,,,,,,,,,,,,,,,,,,,,,,,,,,,,,,,,,,,,,,,,,,,,,,,,,,,,,,,,,,,5,3,4,5,2,4,4,5,4,1,0,1,1,1,0,0,,,1,1,1,0,0,,,,1,0,1,0,1,0,1,1,0,,1,0,0,,1,1,0,,1,1,1,1,1,1,0,,1,1,1,0,31.68,29.29,0,1,,1,1,2,0,0,0,0,1,1,1,0,0,0,0,0,0,0,0,0,0,0,0,1,3,0,0,0,2,1,1,2,2,1,,2,,0,7,2,2,0,0,0,0,0,4,3,0,0,0,600,,1,48,48,0,0,0,3,0,600
40004228,1,1,4,2,2,2000,85122234,0,0,0,3282.4825614,1,0,0,1,0,0,0,0,0,0,0,0,0,0,0,0,0,0,,,,,,,,,0,0,,0,,,,,,,,,3,,3,,0,2,1,1,,,,,,,,,,,,,,,,,,,,,,,,,,,,,,,,,,,,,,,,,,,,,,,,,,,,,,,,,,,,,,,,,,,,,,,M,M,M,0,0,,0,,0,0,,,,,,,,,,,,,,,,,,,,,,,,,,,,,,,,,,,,,,0,,,,,,,,,,,,0,0,1,1,0,,,0,0,3,0,0,0,0,0,0,0,,0,,0,,,,,,,,0,0,0,0,0,0,0,0,1,0,0,0,0,1,0,2,3,0,0,0,0,0,0,0,0,1,0,0,0,0,1,,,,1,1,,,,,,,,,1000,0,,,,,,10,10,,,,,,,,,,,,,,,,,,,,,,,,,,,,,,,,,,,,,,,,,,,,,,,,,,,,,,,,,,,,,,,,,,,,,0,0,0,1,0,0,0,0,0,0,0,0,0,0,0,0,1,1,0,0,0,0,0,0,0,0,,,,,,,,,,,,,,,,,,,,,,,,,,,,,,,,,,,,,,,,,,,,,,,,,,,,,,,,,,,,,,,,,,,,,,,,,,,,,,,,,,,,,,,,,,,,,,,,,,,,,,,,,,,,,,,,,,,,,,,,,,,,,,,,,,1,1,8,0,0,1,0,7,0,0,0,0,0,0,0,5,0,500,5,1,0.5,0,0,1,0,7,0,0,0,0,0,0,0,5,0,500,,,,,,,,,,,,,,,,,,,,,,,,,,,,,,,,,,,,,,,,,,,,,,,,,,,,,,,4,2,3,1,3,2,4,3,3,1,1,1,0,,,0,,,0,,0,,,,,,1,1,0,,0,,0,,0,,0,,0,,0,,0,,0,,0,,0,,0,,0,0,0,0,50.2,33.21,0,,,1,0,2,7,0,0,0,,1,0,0,0,1,0,0,0,0,0,0,0,0,0,1,0,0,280,0,3,1,2,1,2,1,,2,,1,5,2,2,0,0,0,0,0,7,4,0,300,300,300,,1,48,48,300,0,300,2,0,300
40000600,1,1,2,2,3,3000,85124319,0,0,0,409.12617336,1,0,0,1,0,0,0,0,0,0,1,0,0,0,0,0,0,0,,,,,,,,,0,1,1,1,6,2,0,,,,,,3,,3,,1,2,0,1,,,,,,,,,,,,,,,,,,,,,,,,,,,,,,,,,,,,,,,,,,,,,,,,,,,,,,,,,,,,,,,,,,M,M,M,M,,M,M,M,0,0,,0,,0,0,,,,,,,,,,,,,,,,,,,,,,,,,,,,,,,,,,,,,,0,,,,,,,,,,,,0,0,0,0,0,,,,,,,,,,,,,,0,,0,,,,,,,,0,0,0,0,0,0,0,0,0,0,0,0,0,0,0,0,0,0,0,0,0,0,0,0,0,0,0,0,0,0,0,,,,,,,,,,,,,,0,0,,,,,,,,,,,,,,,,,,,,,,,,,,,,,,,,,,,,,,,,,,,,,,,,,,,,,,,,,,,,,,,,,,,,,,,,,,,,,,,,,,,,,,,,,,,,,,,,,,,,,,,,,,,,,,,,,,,,,,,,,,,,,,,,,,,,,,,,,,,,,,,,,,,,,,,,,,,,,,,,,,,,,,,,,,,,,,,,,,,,,,,,,,,,,,,,,,,,,,,,,,,,,,,,,,,,,,,,,,,,,,,,,,,,,,,,,,,,,,,,,,,,,,,,,,,,,,,,,,,,,,,,,,,,,,,,,,,,,,,,,,,,,,,,,,,,,,,,,,,,,,,,,,,,,,,,,,,,,,,,,1,2,2,3,3,3,3,2,2,1,1,1,1,1,1,0,,,0,,0,,,,,,0,,1,0,0,,0,,0,,1,1,0,,0,,0,,0,,0,,0,,0,,0,1,0,1,51.27,40.97,0,1,,1,1,0,0,0,0,0,0,1,1,0,0,0,0,0,0,0,0,0,0,1,0,1,0,0,500,230,2,D,D,2,6,1,,1,2,0,7,4,1,0,0,0,0,0,2,D,0,500,500,500,,1,144,48,500,0,500,2,0,500
40006277,2,3,4,2,2,3000,85124319,0,7259.5609764,0,4028.1639999,1,1,0,1,0,0,0,0,0,0,0,0,0,0,0,0,0,0,,,,,,,,,0,0,0,0,,,,,,,,,4,,4,,1,2,1,1,,,,,,,,,,,,,,,,,,,,,,,,,,,,,,,,,,,,,,,,,,,,,,,,,,,,,,,,,,,,,,,,,,,,,,,0,,0,0,0,,0,,0,0,,,,,,,,,,,,,,,,,,,,,,,,,,,,,,,,,,,,,,0,,,,,,,,,,,,0,0,0,0,0,,,,,,,,,,,,,,0,,0,,,,,,,,0,0,0,0,0,0,0,0,0,0,0,0,0,0,0,0,0,0,0,0,0,0,0,0,0,0,0,0,0,0,0,,,,,,,,,,,,,,0,0,,,,,,,,,,,,,,,,,,,,,,,,,,,,,,,,,,,,,,,,,,,,,,,,,,,,,,,,,,,,,,,,,,,,,,,,,,,,,,,,,,,,,,,,,,,,,,,,,,,,,,,,,,,,,,,,,,,,,,,,,,,,,,,,,,,,,,,,,,,,,,,,,,,,,,,,,,,,,,,,,,,,,,,,,,,,,,,,,,,,,,,,,,,,,,,,,,,,,,,,,,,,,,,,,,,,,,,,,,,,,,,,,,,,,,,,,,,,,,,,,,,,,,,,,,,,,,,,,,,,,,,,,,,,,,,,,,,,,,,,,,,,,,,,,,,,,,,,,,,,,,,,,,,,,,,,,,,,,,,,,3,5,5,3,4,5,5,5,3,0,1,0,1,1,0,1,1,0,0,,0,,,,,,0,,1,1,1,1,0,,1,1,1,1,1,0,1,0,1,1,0,,0,,1,1,0,,1,1,1,0,32.52,20.13,0,,,1,0,2,0,0,0,0,,1,0,0,0,0,0,0,0,0,0,0,0,0,0,1,0,0,490,0,2,2,2,2,2,1,,2,,0,5,4,2,0,0,0,0,0,1,1,0,500,500,500,,1,361,241,500,0,500,2,0,500
40003571,1,1,2,1,1,1000,85121188,1300.5814797,0,0,685.24284706,1,0,0,1,0,0,1,0,0,0,0,1,1,1,0,0,0,0,,,,,,,,,0,0,,1,2,3,0,,,,,,3,,4,,0,2,1,1,,,,,,,,,,,,,,,,,,,,,,,,,,,,,,,,,,,,,,,,,,,,,,,,,,,,,,,,,,,,,,,,,,0,0,0,1,,,,,0,1,0,0,,0,0,,,,,,,,,,,,,,,,,,,,,,,,,,,,,,,,,,,,,,0,,,,,,,,,,,,0,0,0,0,0,,,,,,,,,,,,,,0,,0,,,,,,,,0,0,0,0,0,0,0,0,0,0,0,0,0,0,0,0,0,0,0,0,0,0,0,0,0,0,0,0,0,0,0,,,,,,,,,,,,,,0,0,,,,,,,,,,,,,,,,,,,,,,,,,,,,,,,,,,,,,,,,,,,,,,,,,,,,,,,,,,,,,,,,,,,,,,,,,,,,,,,,,,,,,,,,,,,,,,,,,,,,,,,,,,,,,,,,,,,,,,,,,,,,,,,,,,,,,,,,,,,,,,,,,,,,,,,,,,,,,,,,,,,,,,,,,,,,,,,,,,,,,,,,,,,,,,,,,,,,,,,,,,,,,,,,,,,,,,,,,,,,,,,,,,,,,,,,,,,,,,,,,,,,,,,,,,,,,,,,,,,,,,,,,,,,,,,,,,,,,,,,,,,,,,,,,,,,,,,,,,,,,,,,,,,,,,,,,,,,,,,,,3,1,2,2,2,1,3,3,3,0,0,1,1,1,0,0,,,0,,0,,,,,,0,,0,,1,1,0,,0,,0,,0,,0,,0,,0,,0,,0,,0,,0,1,1,0,53.34,42.23,1,0,,1,1,0,0,0,0,0,0,0,1,0,0,0,0,0,0,0,0,0,0,0,0,1,0,500,540,0,1,3,2,2,2,1,,1,,1,5,2,4,1,0,2,1,4,1,1,0,0,500,600,1,,30,30,0,550,500,1,,0
40007259,2,3,3,2,1,3000,85095965,8958.2012289,0,0,4719.8452467,1,1,0,1,1,1,0,0,0,0,1,1,1,1,0,0,0,0,,,,,,,,,0,0,,1,3,4,1,3,4,0,,,4,,3,,0,1,0,1,,,,,,,,,,,,,,,,,,,,,,,,,,,,,,,,,,,,,,,,,,,,,,,,,,,,,,,,,,,,,,,,,,0,0,0,0,,,,,0,0,,0,,0,0,,,,,,,,,,,,,,,,,,,,,,,,,,,,,,,,,,,,,,0,,,,,,,,,,,,0,0,0,1,1,0,,0,0,0,0,0,0,0,8,0,0,,1,1,0,,,,,,,,0,0,0,0,0,0,1,0,1,1,0,0,0,1,0,1,2,0,0,0,0,0,0,0,0,0,1,0,0,0,1,,,,,,1,1,,,,,,,0,0,,,,,,,,,11,,,,,,,,,,,,,,,,,,,,,,,,,,,,,,,,,,,,,,,,,,,,,,,,,,,,,,,,,,,,,,,,,,,,,,,,,,,,,,,,,,,,,,,,,,,,,,,,,,,,,,,,,,0,0,0,0,0,1,1,0,0,0,0,0,0,,,,,,,,,,,,,,,,,,,,,,,,,,,,,,,,,,,,,,,,,,,,,,,,,,,,,,,,,,,,,,,,,,,,,,,,,,,,,,,,,,,,,,,,,,,,,,,,,,,,,,,,,,,,,,,,,,,,,,,,,,,,,,,,,,,,,,,,,,,,,,,,,,,,,,,,,,,,,,52.2,1,4,0,0,0,0,0,0,0,0,0,0,0,15,0,0,0,,,,,,,,,,,,,,,,,,,5,4,4,5,4,4,4,3,5,1,1,1,1,0,0,1,1,1,1,1,1,0,0,,,,1,1,1,1,0,,1,0,1,1,1,1,0,,0,,0,,0,,0,,0,,0,,1,1,1,1,27.23,32.31,0,0,,0,,,,,,,,0,1,0,0,0,0,0,0,0,0,0,0,0,0,1,0,600,560,0,1,D,D,2,6,13,0,1,,0,5,4,1,0,0,0,0,0,3,2,0,0,600,600,1,,361,241,0,550,600,1,,0
40002215,2,3,2,2,2,2000,85131106,0,0,0,471.95897288,1,1,0,1,0,0,0,0,0,0,0,0,0,0,0,0,0,0,,,,,,,,,0,0,,0,,,,,,,,,4,,4,,0,1,0,1,,,,,,,,,,,,,,,,,,,,,,,,,,,,,,,,,,,,,,,,,,,,,,,,,,,,,,,,,,,,,,,,,,,,,,,M,M,M,0,0,,0,,0,0,,,,,,,,,,,,,,,,,,,,,,,,,,,,,,,,,,,,,,0,,,,,,,,,,,,0,1,0,0,0,0,,,,,,,,,,,,,0,,0,,,,,,,,0,0,0,1,0,0,0,0,0,0,0,0,0,1,1,0,1,0,0,0,0,0,0,0,0,0,0,0,0,0,0,,,,,,,,,,,,,,0,0,,,,,,,,,,,,,,,,,,,,,,,,,,,,,,,,,,,,,,,,,,,,,,,,,,,,,,,,,,,,,,,,,,,,,,,,,,,,,,,,,,,,,,,,,,,,,,,,,,,,,,,,,,,,,,,,,,,,,,,,,,,,,,,,,,,,,,,,,,,,,,,,,,,,,,,,,,,,,,,,,,,,,,,,,,,,,,,,,,,,,,,,,,,,,,,,,,,,,,,,,,,,,,,,,,,,,,,,,,,,,,,,,,,,,,,,,,,,,,,,,,,,,,,,,,,,,,,,,,,,,,,,,,,,,,,,,,,,,,,,,,,,,,,,,,,,,,,,,,,,,,,,,,,,,,,,,,,,,,,,,5,3,4,4,3,4,3,3,4,1,1,0,1,1,0,0,,,0,,1,0,0,,,,0,,0,,0,,0,,0,,1,1,0,,0,,0,,1,1,1,1,1,1,0,,0,1,1,0,31.2,39.74,0,1,,1,1,2,0,0,0,0,1,1,1,0,0,0,0,0,0,0,0,0,0,0,0,1,0,0,650,0,2,1,1,2,2,1,,2,,0,5,4,4,0,1,0,1,0,3,3,0,700,700,700,,1,102,102,650,0,700,2,0,1300
40000096,1,1,1,2,2,2000,85125935,0,0,0,385.20625389,1,0,0,1,0,0,0,0,0,1,0,0,0,0,0,0,0,0,,,,,,,,,0,1,1,0,,,,,,,,,3,,2,2,1,1,0,0,,,,,,,,,,,,,,,,,,,,,,,,,,,,,,,,,,,,,,,,,,,,,,,,,,,,,,,,,,,,,,,,,,,,,,,M,M,M,0,0,,0,,1,,3,,,,,,,,,,,,,,,,,,,,,,,,,,,,,,,,,,,1,,1,1,0,0,0,0,0,1,2,2,2,2,0,0,0,0,0,,,,,,,,,,,,,,0,,0,,,,,,,,0,0,0,0,0,0,0,0,0,0,0,0,0,0,0,0,0,0,0,0,0,0,0,0,0,0,0,0,0,0,0,,,,,,,,,,,,,,0,0,,,,,,,,,,,,,,,,,,,,,,,,,,,,,,,,,,,,,,,,,,,,,,,,,,,,,,,,,,,,,,,,,,,,,,,,,,,,,,,,,,,,,,,,,,,,,,,,,,,,,,,,,,,,,,,,,,,,,,,,,,,,,,,,,,,,,,,,,,,,,,,,,,,,,,,,,,,,,,,,,,,,,,,,,,,,,,,,,,,,,,,,,,,,,,,,,,,,,,,,,,,,,,,,,,,,,,,,,,,,,,,,,,,,,,,,,,,,,,,,,,,,,,,,,,,,,,,,,,,,,,,,,,,,,,,,,,,,,,,,,,,,,,,,,,,,,,,,,,,,,,,,,,,,,,,,,,,,,,,,,4,2,3,1,5,2,5,3,1,0,0,0,1,1,0,0,,,0,,0,,,,,,1,1,1,1,0,,0,,0,,1,1,0,,0,,0,,0,,0,,1,1,0,,1,1,1,0,51.43,21.49,0,,,1,0,2,0,0,0,0,,1,0,0,0,0,0,0,0,0,0,0,0,1,0,1,0,0,780,230,2,D,1,2,2,1,,2,,0,5,4,5,1,2,0,1,1,2,2,0,800,800,800,,1,186,90,800,0,800,2,0,1000
40007031,1,1,3,2,2,1000,85071554,0,2334.6920937,0,1295.4671327,1,1,1,,,,,,,,,,,,,,,,,,,,,,,,1,D,,1,2,3,1,1,D,0,,,2,D,D,,0,1,0,1,1,D,1,2,0,0,0,0,0,0,0,3,3,1,3,2,2,2,2,2,2,1,1,1,62,2,36,D,15,65,1,,,,,,,1,D,0,0,0,1,0,0,0,0,0,0,D,0,0,0,0,0,,0,,,,,,D,D,D,,,,,,1,1,0,0,0,,0,,1,,D,,,,,,,,,,,,,,,,,,,,,,,,,,,,,,,,,,,D,0,1,D,D,D,D,D,D,0,2,2,2,2,0,0,1,0,0,,,0,0,3,0,0,0,0,0,0,0,,0,,0,,,,,,,,0,0,0,0,0,0,0,0,1,0,0,0,0,1,0,1,2,0,0,0,0,0,0,0,0,1,0,0,0,0,1,1,,,,,,,,,,,,,0,0,,,,,,10,,,,,,,,,,,,,,,,,,,,,,,,,,,,,,,,,,,,,,,,,,,,,,,,,,,,,,,,,,,,,,,,,,,,,,1,0,0,0,0,0,0,0,0,0,0,0,0,,,,,,,,,,,,,,,,,,,,,,,,,,,,,,,,,,,,,,,,,,,,,,,,,,,,,,,,,,,,,,,,,,,,,,,,,,,,,,,,,,,,,,,,,,,,,,,,,,,,,,,,,,,,,,,,,,,,,,,,,,,,,,,,,,,,,,,,,,,,,,,156.6,2,0.5,0,0,0,0,7,0,0,0,0,0,0,0,0,0,0,,,,,,,,,,,,,,,,,,,,,,,,,,,,,,,,,,,,,,,,,,,,,,,,,,,,,,,,,,,,,,,,,,,,,,,,,5,2,2,4,4,3,4,3,2,1,1,0,1,1,1,0,,,0,,1,1,0,,,,1,1,0,,0,,0,,0,,1,1,0,,0,,0,,0,,0,,0,,0,,1,1,0,1,44.98,27.79,0,,,1,0,2,0,0,0,0,,1,0,0,0,1,0,0,0,0,0,0,0,0,0,1,D,0,710,0,2,1,D,1,2,1,,2,D,1,5,2,2,0,0,0,0,0,2,D,0,700,700,700,,1,246,180,700,0,700,2,0,700
40004617,2,3,2,2,1,2000,85131106,1312.470825,0,0,691.50703659,1,0,0,1,0,1,1,1,0,1,1,1,1,0,0,0,1,0,,,,,,,,,0,0,,1,2,2,1,1,3,0,,,3,,1,4,0,2,1,1,,,,,,,,,,,,,,,,,,,,,,,,,,,,,,,,,,,,,,,,,,,,,,,,,,,,,,,,,,,,,,,,,,0,1,0,0,,,,,0,1,1,1,0,0,1,,,,,,,,,,,,,,,,,,,,,,,,,,,,,,,,,,,,,,0,,,,,,,,,,,,1,0,0,1,0,,,,,,,,,,,,,,0,,0,,,,,,,,1,0,1,0,1,0,0,0,0,0,0,0,0,1,1,0,3,0,0,0,0,0,0,0,0,0,0,0,0,0,0,,,,,,,,,,,,,,0,0,,,,,,,,,,,,,,,,,,,,,,,,,,,,,,,,,,,,,,,,,,,,,,,,,,,,,,,,,,,,,,,,,,,,,,,,,,,,,,,,,,,,,,,,,,,,,,,,,,,,,,,,,,,,,,,,,,,,,,,,,,,,,,,,,,,,,,,,,,,,,,,,,,,,,,,,,,,,,,,,,,,,,,,,,,,,,,,,,,,,,,,,,,,,,,,,,,,,,,,,,,,,,,,,,,,,,,,,,,,,,,,,,,,,,,,,,,,,,,,,,,,,,,,,,,,,,,,,,,,,,,,,,,,,,,,,,,,,,,,,,,,,,,,,,,,,,,,,,,,,,,,,,,,,,,,,,,,,,,,,,4,2,4,3,3,2,4,3,3,1,0,0,0,,,0,,,0,,1,0,0,,,,0,,0,,0,,0,,0,,0,,0,,0,,0,,0,,0,,0,,0,,1,1,0,0,40.62,35.31,0,1,,1,1,0,0,0,0,0,1,0,1,0,0,0,0,0,0,0,1,0,0,1,0,1,0,600,640,D,1,1,D,1,2,1,,2,D,1,5,2,3,1,0,0,1,1,3,D,0,0,600,600,0,,162,162,0,550,600,1,,0
40004811,2,3,4,2,2,1000,85130714,0,0,0,3965.4230919,1,1,0,1,0,0,0,0,0,0,0,0,0,0,0,0,0,0,,,,,,,,,0,0,,0,,,,,,,,,4,,4,,2,1,0,0,,,,,,,,,,,,,,,,,,,,,,,,,,,,,,,,,,,,,,,,,,,,,,,,,,,,,,,,,,,,,,,,,,,,,,,M,M,M,0,0,,0,,0,0,,,,,,,,,,,,,,,,,,,,,,,,,,,,,,,,,,,,,,0,,,,,,,,,,,,0,0,0,0,0,,,,,,,,,,,,,,0,,0,,,,,,,,0,0,0,0,0,0,0,0,0,0,0,0,0,0,0,0,0,0,0,0,0,0,0,0,0,0,0,0,0,0,0,,,,,,,,,,,,,,0,0,,,,,,,,,,,,,,,,,,,,,,,,,,,,,,,,,,,,,,,,,,,,,,,,,,,,,,,,,,,,,,,,,,,,,,,,,,,,,,,,,,,,,,,,,,,,,,,,,,,,,,,,,,,,,,,,,,,,,,,,,,,,,,,,,,,,,,,,,,,,,,,,,,,,,,,,,,,,,,,,,,,,,,,,,,,,,,,,,,,,,,,,,,,,,,,,,,,,,,,,,,,,,,,,,,,,,,,,,,,,,,,,,,,,,,,,,,,,,,,,,,,,,,,,,,,,,,,,,,,,,,,,,,,,,,,,,,,,,,,,,,,,,,,,,,,,,,,,,,,,,,,,,,,,,,,,,,,,,,,,,3,3,2,3,3,3,3,2,3,1,1,0,0,,,0,,,0,,1,0,1,0,0,5,1,1,0,,0,,0,,1,1,1,1,0,,1,1,0,,0,,1,1,1,1,0,,1,1,1,1,46.15,42.08,0,0,,1,1,2,0,0,0,0,0,1,1,0,0,0,0,0,0,0,1,0,0,0,0,1,0,0,1120,0,5,4,D,2,6,13,1,1,1,0,5,2,1,0,0,0,0,0,1,D,0,600,600,600,,1,361,241,550,0,600,2,0,700